{"text_format":"1","workbook":"xlsx","n_sheets":7,"sheets":["Instructions","Signature Page","3.14.1 ","OLD 3.14.2 ","Reviewer Checklist","3.14.1","OLD 3.14.2"],"not_rendered":{"charts":0,"images":0,"macros":1,"external_links":0,"defined_names":15,"comments":0,"pivot_tables":0},"unopened":[],"bounds":{"document_bytes":16777216,"sheet_cells":100000,"rows_first":2000,"rows_last":500,"rows_between":2000,"halvings":0,"cell_chars":16384,"cell_head_chars":4096},"cells_cut":0,"cells_raw":0,"read":"whole","date_system":"1900"}

{"sheet":"Instructions","index":0,"n_rows":73,"n_cols":9,"rows_kept":73,"cut":false,"hidden":false,"merged":[[40,1,40,12],[70,7,70,9],[44,7,44,9],[0,0,0,12],[2,0,2,12],[1,0,1,12],[3,0,3,12]]}
["State of South Carolina"]
["Section 3.14, Disallowances and Penatlies Reporting Package"]
["Year-End Reporting Instructions"]
["Fiscal Year 2019"]
[]
[]
[null,"Purpose and Objective:"]
[null,"GAAP requires the reporting of liabilities arising from disallowances and penalties."]
[]
[null,"Please refer to the Reporting Policies and Procedures Manual for definitions of terms included on the forms, "]
[null,"concepts involved in the reporting, and related GAAP and other reporting requirements."]
[]
[null,"If questions arise that can not be answered by the Reporting Policies and Procedures Manual, please contact"]
[null,"the Financial Reporting Division of the Comptroller General's Office."]
[]
[null,"Key Terms:"]
[null,"Current Receivable: The portion that is expected to be collected by June 30, 2020.\n"]
[]
[null,"Non-Current Receivable: The portion that is expected to be collected beyond one year (after June 30 2020). "]
[]
[null,"Instructions for Completion of the Forms:"]
[null,"Use the macro button to create as many copies of the form(s) as is required."]
[null,"Enter the information requested by the descriptions of each field."]
[null,"●   Features within the forms to assist in completion include:"]
[null,"►    Drop-down menus are available to assist in the responses to questions on the forms."]
[null,"►    Validation checks for the appropriate number of characters is included for the fund number and "]
[null,"general ledger account number."]
[null,"►    Dollar amounts requested are restricted by edit checks for whole numbers."]
[null,"►    Where appropriate fields are calculated. The agency is responsible for confirming the accuracy"]
[null,"of the calculations.  "]
[null,"Provide sufficient descriptions so that someone not familiar with the daily operations of "]
[null,"the agency can understand the situation."]
[null,"If possible, send a copy of the settlement agreement."]
[null,"Upon completion of the information requested:"]
[null,"●   The individual completing the form(s) should review the form(s) for accuracy and completeness prior to "]
[null,"signing the signature page.  "]
[null,"●   The Finance Director or Executive Director should review and approve the form(s) before signing the "]
[null,"signature page and sending the form(s) to the Comptroller General's Office."]
[null,"●   Both the preparer and reviewer certify that the information provided on this reporting package"]
[null,"is complete and accurate to the best of their knowledge."]
[null,"●   Send the Excel file to the Comptroller General's Office (CAFR@cg.sc.gov) no later than July 19, 2019"]
[null,"●   The agency should retain a copy of the completed form(s) as part of its year-end working papers.  The "]
[null,"Comptroller General's Office will contact the individual completing the form if there are any questions. "]
[]
[null,"Signature Page",null,null,null,null,null,"Signature Page"]
[null,"This form should be completed, printed, signed and a PDF copy of the signed sheet sent via e-mail to the "]
[null,"Comptroller General's office when the Excel file of the related reporting package is sent."]
[]
[null,"Disallowances and Penalties Reporting Form",null,null,null,null,null,null,"3.14.1"]
[null,"This form collects information about liabilities resulting from non-compliance with regulations or the "]
[null,"violation of rules or federal program requirements that occurred before year-end (June 30).  The State"]
[null,"has a liability if it agreed before year-end to make payments or accept reduced revenues after year-end. "]
[null,"Related amounts receivable from outside the State Reporting Entity for a portion or all of this liability"]
[null,"are also reported on this form.  The information reported is recorded by the CAFR team in the general "]
[null,"ledger at a CAFR level (non-agency). "]
[null,"Only the \"end recipient\" of funds within State government should report disallowances and penalties. "]
[null,"See Appendix D of the Reporting Policies and Procedures Manual for a list of entities within the "]
[null,"State's reporting entity."]
[null,"●   Your agency should not report disallowances and penalties related to funds it \"passed through\" to "]
[null,"other entities within the State's reporting entity."]
{"$rows_left_out":14}
{"sheet":"Signature Page","index":1,"n_rows":67,"n_cols":7,"rows_kept":67,"cut":false,"hidden":false,"merged":[[2,1,2,7],[1,1,1,7],[0,1,0,7],[31,4,31,5],[9,4,9,5],[11,4,11,5],[13,4,13,5],[15,4,15,5],[17,4,17,5],[19,4,19,5],[21,4,21,5],[23,4,23,5],[25,4,25,5],[27,4,27,5],[29,4,29,5],[5,4,5,5],[6,4,6,5],[3,1,3,7],[51,1,51,5],[52,1,52,5],[53,1,53,5],[49,1,49,5],[50,1,50,5],[54,1,54,5],[55,1,55,5],[35,1,35,5],[63,1,63,5],[66,1,66,5],[57,1,57,5],[58,1,58,5],[59,1,59,5],[60,1,60,5],[61,1,61,5],[62,1,62,5],[56,1,56,5],[41,1,41,5],[43,1,43,5],[45,1,45,5],[47,1,47,5]]}
[null,"State of South Carolina"]
[null,"Section 3.14, Disallowances and Penatlies Reporting Package"]
[null,"Signature Page"]
[null,"Fiscal Year 2019"]
[]
[null,null,"S001",null,{"$f":"IF(C6=\"\",\"\",VLOOKUP(C6,'3.14.1 '!A97:B175,2))","v":"SAMPLE AGENCY"}]
[null,null,"Agency",null,"Agency Name"]
[]
[]
[null,null,"Preparer","Signature:",null,null," "]
[]
[null,null,null,"Date:","2019-07-19",null," "]
[]
[null,null,null,"Name:","Sample Preparer",null," "]
[]
[null,null,null,"Title:","Accountant",null," "]
[]
[null,null,null,"e-mail:","spreparer@sample.sc.gov",null," "]
[]
[null,null,null,"Phone Number:","(803) 123-4567",null," "]
[]
[null,null,"Reviewer","Signature:",null,null," "]
[]
[null,null,null,"Date:","2019-07-19"]
[]
[null,null,null,"Name:","Sample Reviewer"]
[]
[null,null,null,"Title:","Manager",null," "]
[null,null,null,null,null,null," "]
[null,null,null,"e-mail:","sreviewer@sample.sc.gov",null," "]
[null,null,null,null,null,null," "]
[null,null,null,"Phone Number:","(803) 765-4321",null," "]
[]
[null,null,"Signatures are an assertion of the accuracy and completeness of the information reported.  "]
[]
[null,"Note: This is the ONLY tab from packet 3.14 that is to be submitted in pdf format, all others are submitted via excel format."]
[]
["Your signature on this form certifies that the information provided on the reporting packages is complete and accurate to the best of your knowledge."]
[]
["Representations made by signing as the reviewer:"]
[]
[null,"I acknowledge and have fulfilled the responsibility for implementation and maintenance of internal control relevant to the preparation \nand fair presentation of year end packets that are free from material misstatement, whether due to fraud or error."]
[]
[null,"We have recorded or disclosed all accounting estimates that could be material to the financial statements in accordance with the requirements of U.S. GAAP. "]
[]
[null,"Related party relationships and transactions, including, but not limited to, revenues, expenditures/expenses, loans, transfers, leasing arrangements, and guarantees, and amounts receivable from or payable to related parties have been appropriately accounted for and disclosed in accordance with the requirements of U.S. GAAP."]
[]
[null,"All events occurring subsequent to the date of the financial statements and for which U.S. GAAP requires adjustment or disclosure have been adjusted or disclosed."]
[]
[null,"Special and extraordinary items have been appropriately classified and reported."]
[]
[null,"The effects of all known actual or possible litigation, claims, and assessments have been accounted for and disclosed in accordance with U.S. GAAP."]
[]
[null,"Guarantees, whether written or oral, under which the State is contingently liable, if any, have been properly recorded or disclosed in accordance with U.S. GAAP."]
[]
[null,"The agency has no material amounts of obsolete, damaged, or unusable items included in the inventories at greater than salvage values."]
[]
[null,"The agency has no transfers, reservations or designations of fund equity or interfund borrowings that were not properly authorized and approved, or uncollectible interfund loans that have not been properly reflected in the reporting packets or disclosed to you."]
[]
[null,"Receivables recorded in the reporting packets represent valid claims against debtors for transactions arising on or before the financial statement date and appropriate provisions for uncollectible receivables have been properly identified and recorded."]
{"$rows_left_out":8}
{"sheet":"3.14.1 ","index":2,"n_rows":175,"n_cols":14,"rows_kept":175,"cut":false,"hidden":false,"merged":[[72,1,72,13],[73,1,73,13],[7,4,7,13],[69,1,69,13],[63,8,63,13],[61,8,61,13],[33,4,33,6],[35,1,35,2],[34,1,34,2],[26,1,26,2],[28,12,28,13],[26,12,26,13],[27,1,27,2],[21,11,21,13],[70,1,70,13],[71,1,71,13],[57,8,57,13],[35,12,35,13],[33,12,33,13],[35,4,35,6],[35,8,35,10],[42,7,42,8],[42,10,42,11],[47,1,47,13],[48,1,48,13],[49,1,49,13],[44,1,44,2],[44,4,44,5],[44,7,44,8],[44,10,44,11],[28,1,28,2],[34,4,34,6],[31,1,31,2],[32,1,32,2],[28,4,28,10],[30,1,30,9],[34,8,34,10],[33,1,33,2],[32,4,32,6],[31,4,31,6],[33,8,33,10],[2,0,2,14],[0,0,0,14],[6,4,6,13],[10,4,10,8],[10,10,10,13],[9,3,9,6],[9,11,9,13],[1,0,1,14],[3,0,3,14],[17,7,17,13],[19,7,19,13],[43,1,43,2],[43,4,43,5],[43,7,43,8],[43,10,43,11],[39,6,39,13],[42,1,42,2],[42,4,42,5],[21,1,21,9],[26,4,26,10],[32,12,32,13],[31,12,31,13],[34,12,34,13],[27,12,27,13],[27,4,27,10]]}
["State of South Carolina"]
["Section 3.14, Disallowances and Penatlies Reporting Package"]
["Disallowances and Penalties Reporting Form"]
["At June 30, 2019"]
[]
[]
["Agency:",null,{"$f":"IF('Signature Page'!C6=\"\",\"\",'Signature Page'!C6)","v":"S001"},null,{"$f":"IF(AgencyCode=\"\",\"\",VLOOKUP(AgencyCode,A97:B175,2))","v":"SAMPLE AGENCY"}]
[null,null,null,null,"Agency Name"]
[]
[null,"Preparer (Type Name):",null,{"$f":"IF(Preparer=\"\",\"\",Preparer)","v":"Sample Preparer"},null,null,null,null,null,"Reviewer (Type Name):",null,{"$f":"IF(Reviewer=\"\",\"\",Reviewer)","v":"Sample Reviewer"}]
[]
[null,"Note:  If your agency has more than one disallowance or penalty situation, complete a separate form for each by clicking the button.  "]
[null,null,null,"MUST ENABLE MACROS"]
[]
[null,"Only situations where an agreement has been reached to make payments or accept reduced revenues in a future State fiscal year as "]
[null,"a result of past events that caused a disallowance or penalty should be reported on this form."]
[]
[null,"Name of entity assessing the disallowance or penalty:",null,null,null,null,null,"U.S. Federal Grants Office"]
[]
[null,"Name of program (if applicable):",null,null,null,null,null,"Money for Great State Agencies"]
[]
[null,"Date the State and the disallowance or penalty entity agreed to settlement terms:"]
[]
[null,"Please send a copy of the settlement agreement."]
[]
[null,"Fund(s) responsible for future payment:"]
[null,"Fund Number",null,null,"Fund Name",null,null,null,null,null,null,null,"Percent"]
[null,"52070000",null,null,"Sample Fund",null,null,null,null,null,null,null,0.8]
[null,"10010000",null,null,"Sample Fund",null,null,null,null,null,null,null,0.2]
[]
[null,"State (not Federal) fiscal years and amounts of payments due are:"]
[null,"State",null,null,"Payment",null,null,null,"State",null,null,null,"Payment"]
[null,"Fiscal Year",null,null,"Amount",null,null,null,"Fiscal Year",null,null,null,"Amount"]
[null,"2020",null,null,100000]
[null,"2021",null,null,200000]
[]
[]
[null,"Is there a receivable from outside the State's reporting entity for a portion or all of this liability?"]
[]
[null,"If \"Yes\": Name of entity receivable is due from:"]
[]
[null,"Details for the receivable:"]
[null,"Fund Number",null,null,"GL Account",null,null,"Total",null,null,"Current",null,null,"Non-Current"]
[null,null,null,null,null,null,"$",null,null,"$",null,null,"$",{"$f":"H44-K44","v":0}]
[null,null,null,null,null,null,"$",null,null,"$",null,null,"$",{"$f":"H45-K45","v":0}]
[]
[null,"Other provisions of the disallowance or penalty agreement:"]
[null,"The grant disallowance settlement also requires our agency to forfeit  $150,000 of a grant we have already been awarded that is"]
[null,"for September 1 2020 through November 30, 2020."]
[]
[]
[]
[]
[null,"PASS-THROUGH FUNDS INFORMATION"]
[]
[null,"If the disallowance or penalty relates to funds the agency received from another entity within the State's reporting entity:"]
[]
[null,"Name of State entity funds were received from:"]
[]
[null,"If disallowance or penalty relates to funds the agency \"passed through\" to an entity not within the State's reporting entity:"]
{"$rows_left_out":116}
{"sheet":"OLD 3.14.2 ","index":3,"n_rows":67,"n_cols":14,"rows_kept":67,"cut":false,"hidden":true,"merged":[[0,0,0,14],[1,0,1,14],[5,4,5,13],[6,4,6,13],[7,4,7,8],[7,10,7,13],[20,1,20,9],[20,11,20,13],[25,1,25,2],[25,4,25,10],[25,12,25,13],[26,1,26,2],[26,4,26,10],[26,12,26,13],[27,1,27,2],[27,4,27,10],[27,12,27,13],[29,1,29,9],[30,1,30,2],[30,4,30,6],[30,12,30,13],[31,1,31,2],[31,4,31,6],[31,12,31,13],[60,8,60,13],[38,6,38,13],[32,1,32,2],[32,4,32,6],[32,8,32,10],[32,12,32,13],[33,1,33,2],[33,4,33,6],[33,8,33,10],[33,12,33,13],[71,1,71,13],[72,1,72,13],[16,5,16,13],[18,5,18,13],[41,1,41,2],[42,1,42,2],[43,1,43,2],[42,4,42,5],[43,4,43,5],[41,4,41,5],[42,7,42,8],[43,7,43,8],[42,10,42,11],[43,10,43,11],[41,7,41,8],[62,8,62,13],[8,3,8,6],[8,11,8,13],[9,4,9,8],[9,10,9,13],[70,1,70,13],[68,1,68,13],[69,1,69,13],[34,1,34,2],[34,4,34,6],[34,8,34,10],[34,12,34,13],[46,1,46,13],[47,1,47,13],[41,10,41,11],[48,1,48,13],[56,8,56,13]]}
["STATE OF SOUTH CAROLINA"]
["PENALTY REPORTING FORM"]
[null,null,null,null,null,null,null,"June 30,",{"$f":"IF('3.14.1 '!I4=\"\",\"\",'3.14.1 '!I4)","v":""}]
[null,null,null,null,null,null,"DELETE THIS FORM"]
[]
["Agency:",null,{"$f":"IF('3.14.1 '!C7=\"\",\"\",'3.14.1 '!C7)","v":"S001"},null,{"$f":"IF('3.14.1 '!E7=\"\",\"\",'3.14.1 '!E7)","v":"SAMPLE AGENCY"}]
[null,null,"Business Area",null,"Agency Name"]
[]
[null,"Preparer (Type Name):",null,{"$f":"IF('3.14.1 '!D10=\"\",\"\",'3.14.1 '!D10)","v":"Sample Preparer"},null,null,null,null,null,"Reviewer (Type Name):",null,{"$f":"IF('3.14.1 '!L10=\"\",\"\",'3.14.1 '!L10)","v":"Sample Reviewer"}]
[]
[null,"Note:  If your agency has more than one penalty situation, complete a separate form for each by clicking the button.  "]
[]
[null,null,null,"MUST ENABLE MACROS"]
[]
[]
[]
[null,"Name of entity assessing the penalty:"]
[]
[null,"Name of program (if applicable):"]
[]
[null,"Date the State and the penalty entity agreed to settlement terms:"]
[]
[null,"Does the penalty require payments in future years?"]
[]
[null,"If \"Yes\":  Fund(s) responsible for payment are:"]
[null,"Fund Number",null,null,"Fund Name",null,null,null,null,null,null,null,"Percent"]
[]
[]
[]
[null,"State (not Federal) fiscal years and amounts of payments due are:"]
[null,"State",null,null,"Payment",null,null,null,"State",null,null,null,"Payment"]
[null,"Fiscal Year",null,null,"Amount",null,null,null,"Fiscal Year",null,null,null,"Amount"]
[]
[]
[]
[]
[null,"Is there a receivable from outside the State Reporting Entity for a portion or all of this liability?"]
[]
[null,"If \"Yes\": Name of entity receivable is due from:"]
[]
[null,"Details for receivable are:"]
[null,"Fund Number",null,null,"GL Account",null,null,"Total",null,null,"Current",null,null,"Non-Current"]
[null,null,null,null,null,null,"$",null,null,"$",null,null,"$",{"$f":"H43-K43","v":0}]
[null,null,null,null,null,null,"$",null,null,"$",null,null,"$",{"$f":"H44-K44","v":0}]
[]
[null,"Other provisions of the penalty agreement are:"]
[]
[]
[]
[]
[]
[]
[null,"PASS-THROUGH FUNDS INFORMATION"]
[]
[null,"If penalty relates to funds the agency received from another State agency:"]
[]
[null,"Name of State agency funds were received from:"]
[]
[null,"If penalty relates to funds the agency \"passed through\" to a non-State organization:"]
[]
{"$rows_left_out":8}
{"sheet":"Reviewer Checklist","index":4,"n_rows":29,"n_cols":11,"rows_kept":29,"cut":false,"hidden":false,"merged":[[0,0,0,11],[1,0,1,11],[2,0,2,11],[3,0,3,11]]}
["State of South Carolina"]
["Section 3.14, Disallowances and Penalties Reporting Package"]
["Reviewer Checklist"]
["Fiscal Year 2019"]
[]
[null,null,"Business Area: ",{"$f":"IF(AgencyCode=\"\",\"\",AgencyCode)","v":"S001"},null,null,null,null,"Date Last Review Step Was Completed:   ","2019-07-19"]
[]
[]
["Reviewer's Responses:"]
[{"$f":"COUNT(A$9:A9)+1","v":1},"Is the reviewer of the form(s) someone other than the person who prepared it?",null,null,null,null,null,null,null,null,"Yes"]
[]
[{"$f":"COUNT(A$9:A11)+1","v":2},"Is the contact information (i.e. title, email, and telephone number) for the preparer"]
[null," and reviewer accurately reported on the signature page?",null,null,null,null,null,null,null,null,"Yes"]
[]
[{"$f":"COUNT(A$9:A14)+1","v":3},"Are the amounts reported represented by agreed upon settlement terms?  ",null,null,null,null,null,null,null,null,"Yes"]
[]
[{"$f":"COUNT(A$9:A16)+1","v":4},"Are the fund(s) from which payments are to be paid the appropriate fund(s)?",null,null,null,null,null,null,null,null,"Yes"]
[]
[{"$f":"COUNT(A$9:A18)+1","v":5},"Do the future amounts represent all of the unpaid settlement agreement amounts?",null,null,null,null,null,null,null,null,"Yes"]
[]
[{"$f":"COUNT(A$9:A20)+1","v":6},"Are other provisions of the agreement documented in sufficient detail for "]
[null,"someone not familiar with the daily operations of your agency to understand?",null,null,null,null,null,null,null,null,"Yes"]
[]
[{"$f":"COUNT(A$9:A23)+1","v":7},"Is pass-through information provided only for disallowances or penalties related "]
[null,"to another state entity or passed through to non-state entities?",null,null,null,null,null,null,null,null,"Yes"]
[]
[{"$f":"COUNT(A$9:A26)+1","v":8},"Is the explanation for recognizing or not recognizing a liability to the state in "]
[null,"sufficient detail for someone not familiar with the daily operations of your"]
[null," agency to understand?",null,null,null,null,null,null,null,null,"Yes"]

{"sheet":"3.14.1","index":5,"n_rows":172,"n_cols":14,"rows_kept":172,"cut":false,"hidden":true,"merged":[[0,0,0,14],[1,0,1,14],[5,4,5,13],[6,4,6,13],[8,3,8,6],[8,11,8,13],[9,4,9,8],[9,10,9,13],[16,7,16,13],[18,7,18,13],[20,1,20,9],[20,11,20,13],[25,1,25,2],[25,4,25,10],[25,12,25,13],[26,1,26,2],[26,4,26,10],[26,12,26,13],[27,1,27,2],[27,4,27,10],[27,12,27,13],[29,1,29,9],[30,1,30,2],[30,4,30,6],[30,12,30,13],[31,1,31,2],[31,4,31,6],[31,12,31,13],[32,1,32,2],[32,4,32,6],[32,8,32,10],[32,12,32,13],[33,1,33,2],[33,4,33,6],[33,8,33,10],[33,12,33,13],[34,1,34,2],[34,4,34,6],[34,8,34,10],[34,12,34,13],[47,1,47,13],[38,6,38,13],[41,1,41,2],[41,4,41,5],[41,7,41,8],[41,10,41,11],[42,1,42,2],[42,4,42,5],[42,7,42,8],[42,10,42,11],[70,1,70,13],[71,1,71,13],[72,1,72,13],[7,4,7,8],[7,10,7,13],[48,1,48,13],[56,8,56,13],[60,8,60,13],[62,8,62,13],[68,1,68,13],[69,1,69,13],[43,1,43,2],[43,4,43,5],[43,7,43,8],[43,10,43,11],[46,1,46,13]]}
["STATE OF SOUTH CAROLINA"]
["DISALLOWANCES AND PENALTIES REPORTING FORM"]
[null,null,null,null,null,null,null,"June 30,",2017]
[]
[]
["Agency:",null,{"$f":"IF('3.14.1 '!C7=\"\",\"\",'3.14.1 '!C7)","v":"S001"},null,{"$f":"IF('3.14.1 '!E7=\"\",\"\",'3.14.1 '!E7)","v":"SAMPLE AGENCY"}]
[null,null,"Business Area",null,"Agency Name"]
[]
[null,"Preparer (Type Name):",null,{"$f":"IF('3.14.1 '!D10=\"\",\"\",'3.14.1 '!D10)","v":"Sample Preparer"},null,null,null,null,null,"Reviewer (Type Name):",null,{"$f":"IF('3.14.1 '!L10=\"\",\"\",'3.14.1 '!L10)","v":"Sample Reviewer"}]
[]
[null,"Note:  If your agency has more than one disallowance or penalty situation, complete a separate form for each by clicking the button.  "]
[null,null,null,"MUST ENABLE MACROS"]
[]
[null,"Only situations where an agreement has been reached to make payments or accept reduced revenues in a future State fiscal year as "]
[null,"a result of past events that caused a disallowance or penalty should be reported on this form."]
[]
[null,"Name of entity assessing the disallowance or penalty:"]
[]
[null,"Name of program (if applicable):"]
[]
[null,"Date the State and the disallowance or penalty entity agreed to settlement terms:"]
[]
[null,"Please send a copy of the settlement agreement."]
[]
[null,"Fund(s) responsible for future payment:"]
[null,"Fund Number",null,null,"Fund Name",null,null,null,null,null,null,null,"Percent"]
[]
[]
[]
[null,"State (not Federal) fiscal years and amounts of payments due are:"]
[null,"State",null,null,"Payment",null,null,null,"State",null,null,null,"Payment"]
[null,"Fiscal Year",null,null,"Amount",null,null,null,"Fiscal Year",null,null,null,"Amount"]
[]
[]
[]
[]
[null,"Is there a receivable from outside the State's reporting entity for a portion or all of this liability?"]
[]
[null,"If \"Yes\": Name of entity receivable is due from:"]
[]
[null,"Details for the receivable:"]
[null,"Fund Number",null,null,"GL Account",null,null,"Total",null,null,"Current",null,null,"Non-Current"]
[null,null,null,null,null,null,"$",null,null,"$",null,null,"$",{"$f":"H43-K43","v":0}]
[null,null,null,null,null,null,"$",null,null,"$",null,null,"$",{"$f":"H44-K44","v":0}]
[]
[null,"Other provisions of the disallowance or penalty agreement:"]
[]
[]
[]
[]
[]
[]
[null,"PASS-THROUGH FUNDS INFORMATION"]
[]
[null,"If the disallowance or penalty relates to funds the agency received from another entity within the State's reporting entity:"]
[]
[null,"Name of State entity funds were received from:"]
[]
[null,"If disallowance or penalty relates to funds the agency \"passed through\" to an entity not within the State's reporting entity:"]
[]
{"$rows_left_out":113}
{"sheet":"OLD 3.14.2","index":6,"n_rows":67,"n_cols":14,"rows_kept":67,"cut":false,"hidden":true,"merged":[[68,1,68,13],[69,1,69,13],[70,1,70,13],[71,1,71,13],[72,1,72,13],[34,12,34,13],[38,6,38,13],[62,8,62,13],[42,1,42,2],[42,4,42,5],[42,7,42,8],[42,10,42,11],[43,1,43,2],[43,4,43,5],[43,7,43,8],[43,10,43,11],[46,1,46,13],[47,1,47,13],[48,1,48,13],[56,8,56,13],[60,8,60,13],[41,1,41,2],[41,4,41,5],[41,7,41,8],[41,10,41,11],[32,1,32,2],[32,4,32,6],[32,8,32,10],[34,1,34,2],[34,4,34,6],[34,8,34,10],[32,12,32,13],[33,1,33,2],[33,4,33,6],[33,8,33,10],[33,12,33,13],[29,1,29,9],[30,1,30,2],[30,4,30,6],[30,12,30,13],[31,1,31,2],[31,4,31,6],[31,12,31,13],[26,1,26,2],[26,4,26,10],[26,12,26,13],[27,1,27,2],[27,4,27,10],[27,12,27,13],[16,5,16,13],[18,5,18,13],[20,1,20,9],[20,11,20,13],[25,1,25,2],[25,4,25,10],[25,12,25,13],[8,3,8,6],[8,11,8,13],[9,4,9,8],[9,10,9,13],[0,0,0,14],[1,0,1,14],[5,4,5,13],[6,4,6,13],[7,4,7,8],[7,10,7,13]]}
["STATE OF SOUTH CAROLINA"]
["PENALTY REPORTING FORM"]
[null,null,null,null,null,null,null,"June 30,",{"$f":"IF('3.14.1 '!I4=\"\",\"\",'3.14.1 '!I4)","v":""}]
[]
[]
["Agency:",null,{"$f":"IF('3.14.1 '!C7=\"\",\"\",'3.14.1 '!C7)","v":"S001"},null,{"$f":"IF('3.14.1 '!E7=\"\",\"\",'3.14.1 '!E7)","v":"SAMPLE AGENCY"}]
[null,null,"Business Area",null,"Agency Name"]
[]
[null,"Preparer (Type Name):",null,{"$f":"IF('3.14.1 '!D10=\"\",\"\",'3.14.1 '!D10)","v":"Sample Preparer"},null,null,null,null,null,"Reviewer (Type Name):",null,{"$f":"IF('3.14.1 '!L10=\"\",\"\",'3.14.1 '!L10)","v":"Sample Reviewer"}]
[]
[null,"Note:  If your agency has more than one penalty situation, complete a separate form for each by clicking the button.  "]
[]
[null,null,null,"MUST ENABLE MACROS"]
[]
[]
[]
[null,"Name of entity assessing the penalty:"]
[]
[null,"Name of program (if applicable):"]
[]
[null,"Date the State and the penalty entity agreed to settlement terms:"]
[]
[null,"Does the penalty require payments in future years?"]
[]
[null,"If \"Yes\":  Fund(s) responsible for payment are:"]
[null,"Fund Number",null,null,"Fund Name",null,null,null,null,null,null,null,"Percent"]
[]
[]
[]
[null,"State (not Federal) fiscal years and amounts of payments due are:"]
[null,"State",null,null,"Payment",null,null,null,"State",null,null,null,"Payment"]
[null,"Fiscal Year",null,null,"Amount",null,null,null,"Fiscal Year",null,null,null,"Amount"]
[]
[]
[]
[]
[null,"Is there a receivable from outside the State Reporting Entity for a portion or all of this liability?"]
[]
[null,"If \"Yes\": Name of entity receivable is due from:"]
[]
[null,"Details for receivable are:"]
[null,"Fund Number",null,null,"GL Account",null,null,"Total",null,null,"Current",null,null,"Non-Current"]
[null,null,null,null,null,null,"$",null,null,"$",null,null,"$",{"$f":"H43-K43","v":0}]
[null,null,null,null,null,null,"$",null,null,"$",null,null,"$",{"$f":"H44-K44","v":0}]
[]
[null,"Other provisions of the penalty agreement are:"]
[]
[]
[]
[]
[]
[]
[null,"PASS-THROUGH FUNDS INFORMATION"]
[]
[null,"If penalty relates to funds the agency received from another State agency:"]
[]
[null,"Name of State agency funds were received from:"]
[]
[null,"If penalty relates to funds the agency \"passed through\" to a non-State organization:"]
[]
{"$rows_left_out":7}