{"text_format":"1","workbook":"xlsx","n_sheets":12,"sheets":["Instructions","Signature Page","3.12.1 ","3.12.1 (2)","Reviewer Checklist","Package Response","Package Response (2)","Journal Entry","Journal Entry (2)","Lookup Tables","x3.12.1 ","x3.12.1"],"not_rendered":{"charts":0,"images":0,"macros":1,"external_links":0,"defined_names":7,"comments":0,"pivot_tables":0},"unopened":[],"bounds":{"document_bytes":16777216,"sheet_cells":100000,"rows_first":2000,"rows_last":500,"rows_between":2000,"halvings":0,"cell_chars":16384,"cell_head_chars":4096},"cells_cut":0,"cells_raw":0,"read":"whole","date_system":"1900"}

{"sheet":"Instructions","index":0,"n_rows":98,"n_cols":10,"rows_kept":98,"cut":false,"hidden":false,"merged":[[94,8,94,10],[33,0,33,10],[37,8,37,10],[0,0,0,10],[2,0,2,10],[1,0,1,10],[3,0,3,10]]}
["State of South Carolina"]
["Section 3.12, Accounts Payable Reporting Package"]
["Year-End Reporting Instructions"]
["Fiscal Year 2019"]
[]
["Purpose and Objective:"]
["Generally Accepted Accounting Principles (GAAP) require the State to report accruals of liabilities.  The form(s)"]
["in this reporting package focus on accounts payable, accrued expenses (non-payroll related), and contracts retentions. "]
{"$rows_left_out":91}
{"sheet":"Signature Page","index":1,"n_rows":64,"n_cols":7,"rows_kept":64,"cut":false,"hidden":false,"merged":[[3,1,3,6],[2,1,2,6],[1,1,1,6],[0,1,0,6],[29,4,29,5],[5,4,5,5],[6,4,6,5],[19,4,19,5],[21,4,21,5],[23,4,23,5],[25,4,25,5],[27,4,27,5],[9,4,9,5],[11,4,11,5],[13,4,13,5],[15,4,15,5],[17,4,17,5],[52,1,52,5],[53,1,53,5],[54,1,54,5],[55,1,55,5],[31,4,31,5],[63,1,63,5],[35,1,35,5],[57,1,57,5],[58,1,58,5],[59,1,59,5],[60,1,60,5],[61,1,61,5],[62,1,62,5],[56,1,56,5],[41,1,41,5],[43,1,43,5],[45,1,45,5],[47,1,47,5],[49,1,49,5],[50,1,50,5],[51,1,51,5]]}
[null,"State of South Carolina"]
[null,"Section 3.12, Accounts Payable Reporting Package"]
[null,"Signature Page"]
[null,"Fiscal Year 2019"]
[]
[null,null,"S001",null,{"$f":"IF(C6=\"\",\"\",VLOOKUP($C$6,'Lookup Tables'!$A$1:$B$81,2,FALSE))","v":"Sample Agency"}]
[null,null,"Agency",null,"Agency Name"]
[]
{"$rows_left_out":57}
{"sheet":"3.12.1 ","index":2,"n_rows":40,"n_cols":26,"rows_kept":40,"cut":false,"hidden":false,"merged":[[0,0,0,26],[1,0,1,26],[2,0,2,26],[3,0,3,26],[13,4,13,22],[6,7,6,25],[7,5,7,22],[9,5,9,10],[9,16,9,21],[12,1,12,25]]}
["State of South Carolina"]
["Section 3.12, Accounts Payable Reporting Package"]
["Accounts Payable Summary Form"]
["At June 30, 2019"]
[]
[]
[null,null,"Agency:",null,{"$f":"'Signature Page'!C6","v":"S001"},null,null,{"$f":"VLOOKUP(AgencyCode,'Lookup Tables'!A:B,2,FALSE)","v":"Sample Agency"}]
[null,null,null,null,null,"Agency Name"]
{"$rows_left_out":33}
{"sheet":"3.12.1 (2)","index":3,"n_rows":42,"n_cols":26,"rows_kept":42,"cut":false,"hidden":false,"merged":[[0,0,0,26],[1,0,1,26],[2,0,2,26],[3,0,3,26],[13,4,13,22],[6,7,6,25],[7,5,7,22],[9,5,9,10],[9,16,9,21]]}
["State of South Carolina"]
["Section 3.12, Accounts Payable Reporting Package"]
["Accounts Payable Summary Form"]
["At June 30, 2019"]
[]
[]
[null,null,"Agency:",null,{"$f":"IF('3.12.1 '!E7=\"\",\"\",'3.12.1 '!E7)","v":"S001"},null,null,{"$f":"IF('3.12.1 '!H7:Z7=\"\",\"\",'3.12.1 '!H7:Z7)","v":"Sample Agency"}]
[null,null,null,null,null,"Agency Name"]
{"$rows_left_out":35}
{"sheet":"Reviewer Checklist","index":4,"n_rows":41,"n_cols":11,"rows_kept":41,"cut":false,"hidden":false,"merged":[[1,0,1,11],[3,0,3,11],[2,0,2,11],[0,0,0,11]]}
["State of South Carolina"]
["Section 3.12, Accounts Payable Reporting Package"]
["Reviewer Checklist"]
["Fiscal Year 2019"]
[]
[null,"Business Area",null,{"$f":"IF(AgencyCode=\"\",\"\",AgencyCode)","v":"S001"},null,null,null,null,"Date Last Review Step Was Completed:   ","2019-09-13"]
[]
[]
{"$rows_left_out":34}
{"sheet":"Package Response","index":5,"n_rows":24,"n_cols":16,"rows_kept":24,"cut":false,"hidden":true,"merged":[]}
[null,null,null,null,null,null,2010000000,2010150000,2010010000,2010030000,2010120000,2010070000,2050030000,2400130000]
["Line","Agency Code","LOOKUP\nBusiness Area","LOOKUP\nAgency Name","LOOKUP\nExpense G/L","Fund \nNumber","Vendor \nPayables","Aid","Sales/Use","Accrued\nExpenses ","Intergov","Contract\nCurrent","Contract\nNon-current","Other","GAAP Individual Code","Agency Total"]
[1,{"$f":"AgencyCode","v":"S001"},{"$f":"VLOOKUP(B:B,'Lookup Tables'!A:C,3,FALSE)","v":"S001"},{"$f":"VLOOKUP(B:B,'Lookup Tables'!A:B,2,FALSE)","v":"Sample Agency"},{"$f":"VLOOKUP(C:C,'Lookup Tables'!E:F,2,FALSE)","v":{"$error":"#N/A"}},{"$f":"'3.12.1 '!B19","v":10010000},{"$f":"'3.12.1 '!E19","v":2500},{"$f":"'3.12.1 '!H19","v":0},{"$f":"'3.12.1 '!K19","v":0},{"$f":"'3.12.1 '!N19","v":0},{"$f":"'3.12.1 '!Q19","v":15000},{"$f":"'3.12.1 '!T19","v":0},{"$f":"'3.12.1 '!W19","v":0},{"$f":"'3.12.1 '!Z19","v":0},null,{"$f":"SUM(G3:N3)","v":17500}]
[2,"S001",{"$f":"VLOOKUP(B:B,'Lookup Tables'!A:C,3,FALSE)","v":"S001"},{"$f":"VLOOKUP(B:B,'Lookup Tables'!A:B,2,FALSE)","v":"Sample Agency"},{"$f":"VLOOKUP(C:C,'Lookup Tables'!E:F,2,FALSE)","v":{"$error":"#N/A"}},{"$f":"'3.12.1 '!B20","v":30350000},{"$f":"'3.12.1 '!E20","v":1000},{"$f":"'3.12.1 '!H20","v":0},{"$f":"'3.12.1 '!K20","v":0},{"$f":"'3.12.1 '!N20","v":0},{"$f":"'3.12.1 '!Q20","v":0},{"$f":"'3.12.1 '!T20","v":0},{"$f":"'3.12.1 '!W20","v":0},{"$f":"'3.12.1 '!Z20","v":0},null,{"$f":"SUM(G4:N4)","v":1000}]
[3,"S001",{"$f":"VLOOKUP(B:B,'Lookup Tables'!A:C,3,FALSE)","v":"S001"},{"$f":"VLOOKUP(B:B,'Lookup Tables'!A:B,2,FALSE)","v":"Sample Agency"},{"$f":"VLOOKUP(C:C,'Lookup Tables'!E:F,2,FALSE)","v":{"$error":"#N/A"}},{"$f":"'3.12.1 '!B21","v":0},{"$f":"'3.12.1 '!E21","v":0},{"$f":"'3.12.1 '!H21","v":0},{"$f":"'3.12.1 '!K21","v":0},{"$f":"'3.12.1 '!N21","v":0},{"$f":"'3.12.1 '!Q21","v":0},{"$f":"'3.12.1 '!T21","v":0},{"$f":"'3.12.1 '!W21","v":0},{"$f":"'3.12.1 '!Z21","v":0},null,0]
[4,"S001",{"$f":"VLOOKUP(B:B,'Lookup Tables'!A:C,3,FALSE)","v":"S001"},{"$f":"VLOOKUP(B:B,'Lookup Tables'!A:B,2,FALSE)","v":"Sample Agency"},{"$f":"VLOOKUP(C:C,'Lookup Tables'!E:F,2,FALSE)","v":{"$error":"#N/A"}},{"$f":"'3.12.1 '!B22","v":0},{"$f":"'3.12.1 '!E22","v":0},{"$f":"'3.12.1 '!H22","v":0},{"$f":"'3.12.1 '!K22","v":0},{"$f":"'3.12.1 '!N22","v":0},{"$f":"'3.12.1 '!Q22","v":0},{"$f":"'3.12.1 '!T22","v":0},{"$f":"'3.12.1 '!W22","v":0},{"$f":"'3.12.1 '!Z22","v":0},null,0]
[5,"S001",{"$f":"VLOOKUP(B:B,'Lookup Tables'!A:C,3,FALSE)","v":"S001"},{"$f":"VLOOKUP(B:B,'Lookup Tables'!A:B,2,FALSE)","v":"Sample Agency"},{"$f":"VLOOKUP(C:C,'Lookup Tables'!E:F,2,FALSE)","v":{"$error":"#N/A"}},{"$f":"'3.12.1 '!B23","v":0},{"$f":"'3.12.1 '!E23","v":0},{"$f":"'3.12.1 '!H23","v":0},{"$f":"'3.12.1 '!K23","v":0},{"$f":"'3.12.1 '!N23","v":0},{"$f":"'3.12.1 '!Q23","v":0},{"$f":"'3.12.1 '!T23","v":0},{"$f":"'3.12.1 '!W23","v":0},{"$f":"'3.12.1 '!Z23","v":0},null,0]
[6,"S001",{"$f":"VLOOKUP(B:B,'Lookup Tables'!A:C,3,FALSE)","v":"S001"},{"$f":"VLOOKUP(B:B,'Lookup Tables'!A:B,2,FALSE)","v":"Sample Agency"},{"$f":"VLOOKUP(C:C,'Lookup Tables'!E:F,2,FALSE)","v":{"$error":"#N/A"}},{"$f":"'3.12.1 '!B24","v":0},{"$f":"'3.12.1 '!E24","v":0},{"$f":"'3.12.1 '!H24","v":0},{"$f":"'3.12.1 '!K24","v":0},{"$f":"'3.12.1 '!N24","v":0},{"$f":"'3.12.1 '!Q24","v":0},{"$f":"'3.12.1 '!T24","v":0},{"$f":"'3.12.1 '!W24","v":0},{"$f":"'3.12.1 '!Z24","v":0},null,0]
{"$rows_left_out":17}
{"sheet":"Package Response (2)","index":6,"n_rows":24,"n_cols":16,"rows_kept":24,"cut":false,"hidden":true,"merged":[]}
[null,null,null,null,null,null,2010000000,2010150000,2010010000,2010030000,2010120000,2010070000,2050030000,2400130000]
["Line","Agency Code","LOOKUP\nBusiness Area","LOOKUP\nAgency Name","LOOKUP\nExpense G/L","Fund \nNumber","Vendor \nPayables","Aid","Sales/Use","Accrued\nExpenses ","Intergov","Contract\nCurrent","Contract\nNon-current","Other","GAAP Individual Code","Agency Total"]
[21,{"$f":"AgencyCode","v":"S001"},{"$f":"VLOOKUP(B:B,'Lookup Tables'!A:C,3,FALSE)","v":"S001"},{"$f":"VLOOKUP(B:B,'Lookup Tables'!A:B,2,FALSE)","v":"Sample Agency"},{"$f":"VLOOKUP(C:C,'Lookup Tables'!E:F,2,FALSE)","v":{"$error":"#N/A"}},{"$f":"'3.12.1 '!B19","v":10010000},{"$f":"'3.12.1 (2)'!E19","v":0},{"$f":"'3.12.1 (2)'!H19","v":0},{"$f":"'3.12.1 (2)'!K19","v":0},{"$f":"'3.12.1 (2)'!N19","v":0},{"$f":"'3.12.1 (2)'!Q19","v":0},{"$f":"'3.12.1 (2)'!T19","v":0},{"$f":"'3.12.1 (2)'!W19","v":0},{"$f":"'3.12.1 (2)'!Z19","v":0},null,{"$f":"SUM(G3:N3)","v":0}]
[22,"S001",{"$f":"VLOOKUP(B:B,'Lookup Tables'!A:C,3,FALSE)","v":"S001"},{"$f":"VLOOKUP(B:B,'Lookup Tables'!A:B,2,FALSE)","v":"Sample Agency"},{"$f":"VLOOKUP(C:C,'Lookup Tables'!E:F,2,FALSE)","v":{"$error":"#N/A"}},{"$f":"'3.12.1 '!B20","v":30350000},{"$f":"'3.12.1 (2)'!E20","v":0},{"$f":"'3.12.1 (2)'!H20","v":0},{"$f":"'3.12.1 (2)'!K20","v":0},{"$f":"'3.12.1 (2)'!N20","v":0},{"$f":"'3.12.1 (2)'!Q20","v":0},{"$f":"'3.12.1 (2)'!T20","v":0},{"$f":"'3.12.1 (2)'!W20","v":0},{"$f":"'3.12.1 (2)'!Z20","v":0},null,{"$f":"SUM(G4:N4)","v":0}]
[23,"S001",{"$f":"VLOOKUP(B:B,'Lookup Tables'!A:C,3,FALSE)","v":"S001"},{"$f":"VLOOKUP(B:B,'Lookup Tables'!A:B,2,FALSE)","v":"Sample Agency"},{"$f":"VLOOKUP(C:C,'Lookup Tables'!E:F,2,FALSE)","v":{"$error":"#N/A"}},{"$f":"'3.12.1 '!B21","v":0},{"$f":"'3.12.1 (2)'!E21","v":0},{"$f":"'3.12.1 (2)'!H21","v":0},{"$f":"'3.12.1 (2)'!K21","v":0},{"$f":"'3.12.1 (2)'!N21","v":0},{"$f":"'3.12.1 (2)'!Q21","v":0},{"$f":"'3.12.1 (2)'!T21","v":0},{"$f":"'3.12.1 (2)'!W21","v":0},{"$f":"'3.12.1 (2)'!Z21","v":0},null,0]
[24,"S001",{"$f":"VLOOKUP(B:B,'Lookup Tables'!A:C,3,FALSE)","v":"S001"},{"$f":"VLOOKUP(B:B,'Lookup Tables'!A:B,2,FALSE)","v":"Sample Agency"},{"$f":"VLOOKUP(C:C,'Lookup Tables'!E:F,2,FALSE)","v":{"$error":"#N/A"}},{"$f":"'3.12.1 '!B22","v":0},{"$f":"'3.12.1 (2)'!E22","v":0},{"$f":"'3.12.1 (2)'!H22","v":0},{"$f":"'3.12.1 (2)'!K22","v":0},{"$f":"'3.12.1 (2)'!N22","v":0},{"$f":"'3.12.1 (2)'!Q22","v":0},{"$f":"'3.12.1 (2)'!T22","v":0},{"$f":"'3.12.1 (2)'!W22","v":0},{"$f":"'3.12.1 (2)'!Z22","v":0},null,0]
[25,"S001",{"$f":"VLOOKUP(B:B,'Lookup Tables'!A:C,3,FALSE)","v":"S001"},{"$f":"VLOOKUP(B:B,'Lookup Tables'!A:B,2,FALSE)","v":"Sample Agency"},{"$f":"VLOOKUP(C:C,'Lookup Tables'!E:F,2,FALSE)","v":{"$error":"#N/A"}},{"$f":"'3.12.1 '!B23","v":0},{"$f":"'3.12.1 (2)'!E23","v":0},{"$f":"'3.12.1 (2)'!H23","v":0},{"$f":"'3.12.1 (2)'!K23","v":0},{"$f":"'3.12.1 (2)'!N23","v":0},{"$f":"'3.12.1 (2)'!Q23","v":0},{"$f":"'3.12.1 (2)'!T23","v":0},{"$f":"'3.12.1 (2)'!W23","v":0},{"$f":"'3.12.1 (2)'!Z23","v":0},null,0]
[26,"S001",{"$f":"VLOOKUP(B:B,'Lookup Tables'!A:C,3,FALSE)","v":"S001"},{"$f":"VLOOKUP(B:B,'Lookup Tables'!A:B,2,FALSE)","v":"Sample Agency"},{"$f":"VLOOKUP(C:C,'Lookup Tables'!E:F,2,FALSE)","v":{"$error":"#N/A"}},{"$f":"'3.12.1 '!B24","v":0},{"$f":"'3.12.1 (2)'!E24","v":0},{"$f":"'3.12.1 (2)'!H24","v":0},{"$f":"'3.12.1 (2)'!K24","v":0},{"$f":"'3.12.1 (2)'!N24","v":0},{"$f":"'3.12.1 (2)'!Q24","v":0},{"$f":"'3.12.1 (2)'!T24","v":0},{"$f":"'3.12.1 (2)'!W24","v":0},{"$f":"'3.12.1 (2)'!Z24","v":0},null,0]
{"$rows_left_out":17}
{"sheet":"Journal Entry","index":7,"n_rows":200,"n_cols":9,"rows_kept":200,"cut":false,"hidden":true,"merged":[]}
["Row","GL Acct","Description","Row Amt","D/C","Cost","Functional Area","Fund","Row Text"]
[{"$f":"'Package Response'!A3","v":1},{"$f":"'Package Response'!E3","v":{"$error":"#N/A"}},"CAFR Expense",{"$f":"'Package Response'!P3","v":17500},"D",{"$f":"'Package Response'!$C$3&\"00CAFR\"","v":"S00100CAFR"},{"$f":"'Package Response'!$C$3&\"_CAFR\"","v":"S001_CAFR"},{"$f":"'Package Response'!$F$3","v":10010000},{"$f":"\"Accounts Payable \" &'Package Response'!$B$3&\" Row 1\"","v":"Accounts Payable S001 Row 1"}]
[null,2010000000,{"$f":"VLOOKUP(B3,'Lookup Tables'!$H$2:$I$9,2,FALSE)","v":"Accounts Payable"},{"$f":"'Package Response'!G3","v":2500},"C",{"$f":"'Package Response'!$C$3&\"00CAFR\"","v":"S00100CAFR"},{"$f":"'Package Response'!$C$3&\"_CAFR\"","v":"S001_CAFR"},{"$f":"'Package Response'!$F$3","v":10010000},{"$f":"\"Accounts Payable \" &'Package Response'!$B$3&\" Row 1\"","v":"Accounts Payable S001 Row 1"}]
[null,2010150000,{"$f":"VLOOKUP(B4,'Lookup Tables'!$H$2:$I$9,2,FALSE)","v":"Pay-Aid Indiv/Fam"},{"$f":"'Package Response'!H3","v":0},"C",{"$f":"'Package Response'!$C$3&\"00CAFR\"","v":"S00100CAFR"},{"$f":"'Package Response'!$C$3&\"_CAFR\"","v":"S001_CAFR"},{"$f":"'Package Response'!$F$3","v":10010000},{"$f":"\"Accounts Payable \" &'Package Response'!$B$3&\" Row 1\"","v":"Accounts Payable S001 Row 1"}]
[null,2010010000,{"$f":"VLOOKUP(B5,'Lookup Tables'!$H$2:$I$9,2,FALSE)","v":"Sales Tax Payable"},{"$f":"'Package Response'!I3","v":0},"C",{"$f":"'Package Response'!$C$3&\"00CAFR\"","v":"S00100CAFR"},{"$f":"'Package Response'!$C$3&\"_CAFR\"","v":"S001_CAFR"},{"$f":"'Package Response'!$F$3","v":10010000},{"$f":"\"Accounts Payable \" &'Package Response'!$B$3&\" Row 1\"","v":"Accounts Payable S001 Row 1"}]
[null,2010030000,{"$f":"VLOOKUP(B6,'Lookup Tables'!$H$2:$I$9,2,FALSE)","v":"Accrued Accounts Payable"},{"$f":"'Package Response'!J3","v":0},"C",{"$f":"'Package Response'!$C$3&\"00CAFR\"","v":"S00100CAFR"},{"$f":"'Package Response'!$C$3&\"_CAFR\"","v":"S001_CAFR"},{"$f":"'Package Response'!$F$3","v":10010000},{"$f":"\"Accounts Payable \" &'Package Response'!$B$3&\" Row 1\"","v":"Accounts Payable S001 Row 1"}]
[null,2010120000,{"$f":"VLOOKUP(B7,'Lookup Tables'!$H$2:$I$9,2,FALSE)","v":"Intergov Payable"},{"$f":"'Package Response'!K3","v":15000},"C",{"$f":"'Package Response'!$C$3&\"00CAFR\"","v":"S00100CAFR"},{"$f":"'Package Response'!$C$3&\"_CAFR\"","v":"S001_CAFR"},{"$f":"'Package Response'!$F$3","v":10010000},{"$f":"\"Accounts Payable \" &'Package Response'!$B$3&\" Row 1\"","v":"Accounts Payable S001 Row 1"}]
[null,2010070000,{"$f":"VLOOKUP(B8,'Lookup Tables'!$H$2:$I$9,2,FALSE)","v":"Retainage Payable"},{"$f":"'Package Response'!L3","v":0},"C",{"$f":"'Package Response'!$C$3&\"00CAFR\"","v":"S00100CAFR"},{"$f":"'Package Response'!$C$3&\"_CAFR\"","v":"S001_CAFR"},{"$f":"'Package Response'!$F$3","v":10010000},{"$f":"\"Accounts Payable \" &'Package Response'!$B$3&\" Row 1\"","v":"Accounts Payable S001 Row 1"}]
{"$rows_left_out":193}
{"sheet":"Journal Entry (2)","index":8,"n_rows":200,"n_cols":9,"rows_kept":200,"cut":false,"hidden":true,"merged":[]}
["Row","GL Acct","Description","Row Amt","D/C","Cost","Functional Area","Fund","Row Text"]
[{"$f":"'Package Response (2)'!A3","v":21},{"$f":"'Package Response (2)'!E3","v":{"$error":"#N/A"}},"CAFR Expense",{"$f":"'Package Response (2)'!P3","v":0},"D",{"$f":"'Package Response (2)'!$C$3&\"00CAFR\"","v":"S00100CAFR"},{"$f":"'Package Response (2)'!$C$3&\"_CAFR\"","v":"S001_CAFR"},{"$f":"'Package Response (2)'!$F$3","v":10010000},{"$f":"\"Accounts Payable \" &'Package Response (2)'!$B$3&\" Row 21\"","v":"Accounts Payable S001 Row 21"}]
[null,2010000000,{"$f":"VLOOKUP(B3,'Lookup Tables'!$H$2:$I$9,2,FALSE)","v":"Accounts Payable"},{"$f":"'Package Response (2)'!G3","v":0},"C",{"$f":"'Package Response (2)'!$C$3&\"00CAFR\"","v":"S00100CAFR"},{"$f":"'Package Response (2)'!$C$3&\"_CAFR\"","v":"S001_CAFR"},{"$f":"'Package Response (2)'!$F$3","v":10010000},{"$f":"\"Accounts Payable \" &'Package Response (2)'!$B$3&\" Row 21\"","v":"Accounts Payable S001 Row 21"}]
[null,2010150000,{"$f":"VLOOKUP(B4,'Lookup Tables'!$H$2:$I$9,2,FALSE)","v":"Pay-Aid Indiv/Fam"},{"$f":"'Package Response (2)'!H3","v":0},"C",{"$f":"'Package Response (2)'!$C$3&\"00CAFR\"","v":"S00100CAFR"},{"$f":"'Package Response (2)'!$C$3&\"_CAFR\"","v":"S001_CAFR"},{"$f":"'Package Response (2)'!$F$3","v":10010000},{"$f":"\"Accounts Payable \" &'Package Response (2)'!$B$3&\" Row 21\"","v":"Accounts Payable S001 Row 21"}]
[null,2010010000,{"$f":"VLOOKUP(B5,'Lookup Tables'!$H$2:$I$9,2,FALSE)","v":"Sales Tax Payable"},{"$f":"'Package Response (2)'!I3","v":0},"C",{"$f":"'Package Response (2)'!$C$3&\"00CAFR\"","v":"S00100CAFR"},{"$f":"'Package Response (2)'!$C$3&\"_CAFR\"","v":"S001_CAFR"},{"$f":"'Package Response (2)'!$F$3","v":10010000},{"$f":"\"Accounts Payable \" &'Package Response (2)'!$B$3&\" Row 21\"","v":"Accounts Payable S001 Row 21"}]
[null,2010030000,{"$f":"VLOOKUP(B6,'Lookup Tables'!$H$2:$I$9,2,FALSE)","v":"Accrued Accounts Payable"},{"$f":"'Package Response (2)'!J3","v":0},"C",{"$f":"'Package Response (2)'!$C$3&\"00CAFR\"","v":"S00100CAFR"},{"$f":"'Package Response (2)'!$C$3&\"_CAFR\"","v":"S001_CAFR"},{"$f":"'Package Response (2)'!$F$3","v":10010000},{"$f":"\"Accounts Payable \" &'Package Response (2)'!$B$3&\" Row 21\"","v":"Accounts Payable S001 Row 21"}]
[null,2010120000,{"$f":"VLOOKUP(B7,'Lookup Tables'!$H$2:$I$9,2,FALSE)","v":"Intergov Payable"},{"$f":"'Package Response (2)'!K3","v":0},"C",{"$f":"'Package Response (2)'!$C$3&\"00CAFR\"","v":"S00100CAFR"},{"$f":"'Package Response (2)'!$C$3&\"_CAFR\"","v":"S001_CAFR"},{"$f":"'Package Response (2)'!$F$3","v":10010000},{"$f":"\"Accounts Payable \" &'Package Response (2)'!$B$3&\" Row 21\"","v":"Accounts Payable S001 Row 21"}]
[null,2010070000,{"$f":"VLOOKUP(B8,'Lookup Tables'!$H$2:$I$9,2,FALSE)","v":"Retainage Payable"},{"$f":"'Package Response (2)'!L3","v":0},"C",{"$f":"'Package Response (2)'!$C$3&\"00CAFR\"","v":"S00100CAFR"},{"$f":"'Package Response (2)'!$C$3&\"_CAFR\"","v":"S001_CAFR"},{"$f":"'Package Response (2)'!$F$3","v":10010000},{"$f":"\"Accounts Payable \" &'Package Response (2)'!$B$3&\" Row 21\"","v":"Accounts Payable S001 Row 21"}]
{"$rows_left_out":193}
{"sheet":"Lookup Tables","index":9,"n_rows":81,"n_cols":9,"rows_kept":81,"cut":false,"hidden":true,"merged":[]}
["Agency","Agency Name","CAFR Business Area",null,"CAFR Business Area","Expense Account",null,"Payable Account","Account Name"]
["A010","Legislative Department - The Senate","A000",null,"A000",5510101010,null,2010000000,"Accounts Payable"]
["A050","Legislative Department - House of Representatives","A000",null,"H000",5510201020,null,2010150000,"Pay-Aid Indiv/Fam"]
["A150","Legislative Department - Codification of Laws & Legislative Council","A000",null,"J000",5510251025,null,2010010000,"Sales Tax Payable"]
["A170","Legislative Department - Legislative Services Agency","A000",null,"L000",5510351035,null,2010030000,"Accrued Accounts Payable"]
["A200","Legislative Department - Legislative Audit Council","A000",null,"N000",5510401040,null,2010120000,"Intergov Payable"]
["A850","Education Oversight Committee","A000",null,"P000",5510501050,null,2010070000,"Retainage Payable"]
["B040","Judicial Department","N000",null,"U000",5510601060,null,2050030000,"Retainage Non-Current"]
{"$rows_left_out":74}
{"sheet":"x3.12.1 ","index":10,"n_rows":145,"n_cols":22,"rows_kept":145,"cut":false,"hidden":true,"merged":[[0,0,0,9],[1,0,1,9],[8,3,8,4],[6,4,6,7],[34,4,34,7],[21,4,21,7],[22,4,22,7],[8,7,8,9],[5,4,5,9],[28,4,28,7],[29,4,29,7],[30,4,30,7],[31,4,31,7],[32,4,32,7],[23,4,23,7],[24,4,24,7],[55,4,55,7],[56,4,56,7],[49,4,49,7],[50,4,50,7],[51,4,51,7],[52,4,52,7],[53,4,53,7],[54,4,54,7],[46,4,46,7],[47,4,47,7],[48,4,48,7],[35,4,35,7],[33,4,33,7],[41,4,41,7],[42,4,42,7],[43,4,43,7],[44,4,44,7],[45,4,45,7],[25,4,25,7],[26,4,26,7],[27,4,27,7],[18,4,18,7],[19,4,19,7],[20,4,20,7]]}
["STATE OF SOUTH CAROLINA"]
["AP RECONCILIATION FORM"]
[null,null,null,null,null,"At June 30,",2016]
[]
[]
[null,"Agency:",null,null,{"$f":"IF(AgencyCode=\"\",\"\",VLOOKUP(AgencyCode,B68:C145,2))","v":"DEPARTMENT OF EMPLOYMENT AND WORKFORCE"},null,null,null,null,null,null,null,"AP Reconciliation Form",null,null,null,null,null,null,null,null,"3.12.1"]
[null,null,"Business Area",null,"Agency Name",null,null,null,null,null,null,null,"Use this form to reconcile the SCEIS Yearend Rptg - Prior Year Payables report provided to the payables"]
[null,null,null,null,null,null,null,null,null,null,null,null,"categorized on the Accounts Payable Summary Form (form 3.12.2)."]
{"$rows_left_out":138}
{"sheet":"x3.12.1","index":11,"n_rows":200,"n_cols":10,"rows_kept":200,"cut":false,"hidden":true,"merged":[[82,4,82,8],[83,4,83,8],[84,4,84,8],[93,4,93,8],[94,4,94,8],[95,4,95,8],[59,4,59,8],[75,4,75,8],[76,4,76,8],[77,4,77,8],[78,4,78,8],[79,4,79,8],[70,4,70,8],[71,4,71,8],[72,4,72,8],[73,4,73,8],[74,4,74,8],[90,4,90,8],[91,4,91,8],[92,4,92,8],[85,4,85,8],[86,4,86,8],[87,4,87,8],[88,4,88,8],[89,4,89,8],[80,4,80,8],[81,4,81,8],[96,4,96,8],[33,4,33,8],[34,4,34,8],[35,4,35,8],[36,4,36,8],[37,4,37,8],[38,4,38,8],[39,4,39,8],[40,4,40,8],[41,4,41,8],[42,4,42,8],[43,4,43,8],[53,4,53,8],[54,4,54,8],[55,4,55,8],[46,4,46,8],[47,4,47,8],[48,4,48,8],[49,4,49,8],[50,4,50,8],[45,4,45,8],[69,4,69,8],[51,4,51,8],[52,4,52,8],[25,4,25,8],[26,4,26,8],[27,4,27,8],[28,4,28,8],[29,4,29,8],[68,4,68,8],[20,4,20,8],[21,4,21,8],[22,4,22,8],[23,4,23,8],[24,4,24,8],[32,4,32,8],[65,4,65,8],[66,4,66,8],[67,4,67,8],[30,4,30,8],[56,4,56,8],[57,4,57,8],[58,4,58,8],[108,4,108,8],[109,4,109,8],[97,4,97,8],[98,4,98,8],[99,4,99,8],[100,4,100,8],[101,4,101,8],[102,4,102,8],[103,4,103,8],[104,4,104,8],[105,4,105,8],[106,4,106,8],[112,4,112,8],[113,4,113,8],[114,4,114,8],[115,4,115,8],[116,4,116,8],[117,4,117,8],[0,0,0,9],[1,0,1,9],[5,4,5,9],[6,4,6,7],[8,3,8,4],[8,7,8,9],[14,4,14,8],[31,4,31,8],[44,4,44,8],[15,4,15,8],[16,4,16,8],[17,4,17,8],[18,4,18,8],[19,4,19,8],[110,4,110,8],[111,4,111,8],[64,4,64,8],[107,4,107,8]]}
["STATE OF SOUTH CAROLINA"]
["AP RECONCILIATION FORM"]
[null,null,null,null,null,"At June 30,",{"$f":"IF(YEAR=\"\",\"\",YEAR)","v":""}]
[]
[]
[null,"Agency:",{"$f":"IF(AgencyCode=\"\",\"\",AgencyCode)","v":"S001"},null,{"$f":"IF(AgencyName=\"\",\"\",AgencyName)","v":{"$error":"#NAME?"}}]
[null,null,"Business Area",null,"Agency Name"]
[]
{"$rows_left_out":192}