{"text_format":"1","workbook":"xlsx","n_sheets":6,"sheets":["Instructions","Signature 1","3.03.1","3.03.2","3.03.3","3.03.4"],"not_rendered":{"charts":0,"images":0,"macros":0,"external_links":0,"defined_names":8,"comments":0,"pivot_tables":0},"unopened":[],"bounds":{"document_bytes":16777216,"sheet_cells":100000,"rows_first":2000,"rows_last":500,"rows_between":2000,"halvings":0,"cell_chars":16384,"cell_head_chars":4096},"cells_cut":0,"cells_raw":0,"read":"whole","date_system":"1900"}

{"sheet":"Instructions","index":0,"n_rows":143,"n_cols":12,"rows_kept":143,"cut":false,"hidden":false,"merged":[[142,1,142,11],[53,1,53,13]]}
["STATE OF SOUTH CAROLINA"]
["YEAR-END REPORTING PROCEDURES MANUAL"]
["SECTION 3.03, GRANTS AND CONTRIBUTION REVENUES REPORTING PACKAGE"]
[]
[]
[null,"PURPOSE and OBJECTIVE:"]
[null,"Accurate reporting in accordance with GAAP requires the analysis and recognition of receivables and"]
[null,"deferred revenue in connection with grant awards and contributions.  The reporting package aids in"]
[null,"the identification and reporting of accrual amounts at year-end."]
[]
[null,"Grant information provided in this reporting package should be reported only as the end recipient "]
[null,"in the State's Reporting Entity.  Agency's which pass-through to other agencies or within its agency "]
[null,"should not report pass-through activity within the State's Reporting Entity."]
[null,"Note: internal pass through funds should be zero or have minimal balances at 6/30."]
[null,"If you have substantial balances in funds relating to internal pass through activity, these"]
{"$rows_left_out":129}
{"sheet":"Signature 1","index":1,"n_rows":137,"n_cols":6,"rows_kept":137,"cut":false,"hidden":false,"merged":[[136,1,136,5],[125,1,125,5],[127,1,127,5],[129,1,129,5],[131,1,131,5],[133,1,133,5]]}
[null,null,"3.03 Grants and Contributions Revenue Packet"]
[]
[]
[null,null,"CAFR Reporting Period:",null,2019]
[null,null,"Agency Number:",null,"E120"," "]
[null,null,"Agency Name",null,{"$f":"IF(ISERROR(VLOOKUP(AgencyCode,C32:D110,2,FALSE))=TRUE,\"\",VLOOKUP(AgencyCode,C32:D110,2,FALSE))","v":"COMPTROLLER GENERAL'S OFFICE\n"}]
[]
[]
[]
[]
[]
[null,null,"Preparer","Date:",null," "]
[null,null,null,"Name:",null," "]
[null,null,null,"Title:",null," "]
[null,null,null,"e-mail:",null," "]
{"$rows_left_out":123}
{"sheet":"3.03.1","index":2,"n_rows":987,"n_cols":15,"rows_kept":987,"cut":false,"hidden":false,"merged":[[382,1,382,8],[832,1,832,9],[882,1,882,9],[932,1,932,9],[982,1,982,9],[636,11,636,12],[686,11,686,12],[736,11,736,12],[786,11,786,12],[836,11,836,12],[886,11,886,12],[936,11,936,12],[843,10,843,15],[714,11,714,12],[715,11,715,12],[716,11,716,12],[700,11,700,14],[730,11,730,12],[731,11,731,12],[725,11,725,12],[726,11,726,12],[750,11,750,14],[701,11,701,12],[702,11,702,12],[297,6,300,6],[297,11,297,12],[298,11,298,12],[986,11,986,12],[86,11,86,12],[136,11,136,12],[186,11,186,12],[236,11,236,12],[286,11,286,12],[336,11,336,12],[386,11,386,12],[436,11,436,12],[693,10,693,15],[740,4,740,13],[743,2,743,7],[743,10,743,15],[790,4,790,13],[793,2,793,7],[793,10,793,15],[840,4,840,13],[682,1,682,8],[632,1,632,8],[582,1,582,8],[532,1,532,8],[633,1,637,8],[447,6,450,6],[393,2,393,7],[597,6,600,6],[397,6,400,6],[843,2,843,7],[782,1,782,8],[732,1,732,8],[783,1,787,8],[697,6,700,6],[747,6,750,6],[733,1,737,8],[690,4,690,13],[693,2,693,7],[555,11,555,12],[572,11,572,12],[482,1,482,8],[432,1,432,8],[703,11,703,12],[723,11,723,12],[704,11,704,12],[706,11,706,12],[583,1,587,8],[402,11,402,12],[259,11,259,12],[260,11,260,12],[393,10,393,15],[440,4,440,13],[443,2,443,7],[443,10,443,15],[433,1,437,8],[290,4,290,13],[293,2,293,7],[293,10,293,15],[340,4,340,13],[343,2,343,7],[343,10,343,15],[390,4,390,13],[283,1,287,8],[333,1,337,8],[383,1,387,8],[347,6,350,6],[332,1,332,8],[282,1,282,8],[270,11,270,12],[275,11,275,12],[301,11,301,12],[401,11,401,12],[403,11,403,12],[683,1,687,8],[547,6,550,6],[647,6,650,6],[590,4,590,13],[593,2,593,7],[593,10,593,15],[640,4,640,13],[643,2,643,7],[643,10,643,15],[675,11,675,12],[679,11,679,12],[680,11,680,12],[681,11,681,12],[676,11,676,12],[677,11,677,12],[678,11,678,12],[575,11,575,12],[554,11,554,12],[430,11,430,12],[431,11,431,12],[426,11,426,12],[427,11,427,12],[428,11,428,12],[83,1,87,8],[133,1,137,8],[183,1,187,8],[233,1,237,8],[97,6,100,6],[90,4,90,13],[93,2,93,7],[93,10,93,15],[140,4,140,13],[143,2,143,7],[143,10,143,15],[190,4,190,13],[193,2,193,7],[193,10,193,15],[125,11,125,12],[118,11,118,12],[119,11,119,12],[120,11,120,12],[121,11,121,12],[130,11,130,12],[131,11,131,12],[126,11,126,12],[127,11,127,12],[128,11,128,12],[82,1,82,8],[6,4,6,13],[70,11,70,12],[52,11,52,12],[53,11,53,12],[57,11,57,12],[58,11,58,12],[59,11,59,12],[60,11,60,12],[61,11,61,12],[62,11,62,12],[63,11,63,12],[47,6,50,6],[47,11,47,12],[48,11,48,12],[49,11,49,12],[13,6,16,6],[50,11,50,14],[51,11,51,12],[21,11,21,12],[36,11,36,12],[30,11,30,12],[33,1,37,7],[40,4,40,13],[43,2,43,7],[43,10,43,15],[668,11,668,12],[669,11,669,12],[670,11,670,12],[671,11,671,12],[97,11,97,12],[98,11,98,12],[99,11,99,12],[73,11,73,12],[74,11,74,12],[75,11,75,12],[54,11,54,12],[55,11,55,12],[72,11,72,12],[56,11,56,12],[79,11,79,12],[80,11,80,12],[69,11,69,12],[81,11,81,12],[76,11,76,12],[77,11,77,12],[78,11,78,12],[64,11,64,12],[868,11,868,12],[869,11,869,12],[870,11,870,12],[890,4,890,13],[893,2,893,7],[893,10,893,15],[897,6,900,6],[897,11,897,12],[898,11,898,12],[899,11,899,12],[881,11,881,12],[878,11,878,12],[876,11,876,12],[877,11,877,12],[65,11,65,12],[66,11,66,12],[67,11,67,12],[68,11,68,12],[12,16,22,16],[25,16,36,16],[13,11,13,12],[14,11,14,12],[15,11,15,12],[17,11,17,12],[18,11,18,12],[19,11,19,12],[20,11,20,12],[22,11,22,12],[26,11,26,12],[23,11,23,12],[24,11,24,12],[25,11,25,12],[16,11,16,14],[31,11,31,12],[27,11,27,12],[28,11,28,12],[29,11,29,12],[101,11,101,12],[102,11,102,12],[103,11,103,12],[123,11,123,12],[71,11,71,12],[124,11,124,12],[100,11,100,14],[104,11,104,12],[105,11,105,12],[122,11,122,12],[106,11,106,12],[107,11,107,12],[108,11,108,12],[109,11,109,12],[110,11,110,12],[111,11,111,12],[112,11,112,12],[113,11,113,12],[114,11,114,12],[115,11,115,12],[116,11,116,12],[117,11,117,12],[151,11,151,12],[152,11,152,12],[153,11,153,12],[147,6,150,6],[147,11,147,12],[148,11,148,12],[149,11,149,12],[129,11,129,12],[150,11,150,14],[132,1,132,8],[154,11,154,12],[155,11,155,12],[172,11,172,12],[179,11,179,12],[180,11,180,12],[181,11,181,12],[176,11,176,12],[177,11,177,12],[178,11,178,12],[171,11,171,12],[156,11,156,12],[157,11,157,12],[158,11,158,12],[159,11,159,12],[160,11,160,12],[161,11,161,12],[162,11,162,12],[163,11,163,12],[164,11,164,12],[165,11,165,12],[166,11,166,12],[167,11,167,12],[168,11,168,12],[169,11,169,12],[170,11,170,12],[201,11,201,12],[202,11,202,12],[203,11,203,12],[197,6,200,6],[197,11,197,12],[198,11,198,12],[199,11,199,12],[223,11,223,12],[173,11,173,12],[174,11,174,12],[175,11,175,12],[200,11,200,14],[218,11,218,12],[219,11,219,12],[220,11,220,12],[221,11,221,12],[182,1,182,8],[225,11,225,12],[204,11,204,12],[205,11,205,12],[222,11,222,12],[206,11,206,12],[207,11,207,12],[208,11,208,12],[209,11,209,12],[210,11,210,12],[211,11,211,12],[212,11,212,12],[213,11,213,12],[214,11,214,12],[215,11,215,12],[216,11,216,12],[217,11,217,12],[224,11,224,12],[229,11,229,12],[230,11,230,12],[231,11,231,12],[226,11,226,12],[227,11,227,12],[228,11,228,12],[251,11,251,12],[252,11,252,12],[253,11,253,12],[240,4,240,13],[232,1,232,8],[243,2,243,7],[243,10,243,15],[247,6,250,6],[247,11,247,12],[248,11,248,12],[249,11,249,12],[250,11,250,14],[254,11,254,12],[255,11,255,12],[272,11,272,12],[279,11,279,12],[280,11,280,12],[281,11,281,12],[276,11,276,12],[277,11,277,12],[278,11,278,12],[271,11,271,12],[261,11,261,12],[262,11,262,12],[263,11,263,12],[264,11,264,12],[265,11,265,12],[266,11,266,12],[267,11,267,12],[268,11,268,12],[269,11,269,12],[273,11,273,12],[274,11,274,12],[256,11,256,12],[257,11,257,12],[258,11,258,12],[299,11,299,12],[323,11,323,12],[318,11,318,12],[319,11,319,12],[320,11,320,12],[321,11,321,12],[300,11,300,14],[304,11,304,12],[305,11,305,12],[322,11,322,12],[306,11,306,12],[307,11,307,12],[308,11,308,12],[309,11,309,12],[310,11,310,12],[311,11,311,12],[312,11,312,12],[313,11,313,12],[314,11,314,12],[315,11,315,12],[316,11,316,12],[317,11,317,12],[302,11,302,12],[303,11,303,12],[324,11,324,12],[327,11,327,12],[328,11,328,12],[326,11,326,12],[325,11,325,12],[350,11,350,14],[347,11,347,12],[348,11,348,12],[349,11,349,12],[329,11,329,12],[330,11,330,12],[331,11,331,12],[354,11,354,12],[355,11,355,12],[372,11,372,12],[351,11,351,12],[352,11,352,12],[353,11,353,12],[373,11,373,12],[374,11,374,12],[368,11,368,12],[369,11,369,12],[370,11,370,12],[371,11,371,12],[356,11,356,12],[357,11,357,12],[358,11,358,12],[359,11,359,12],[360,11,360,12],[361,11,361,12],[362,11,362,12],[363,11,363,12],[364,11,364,12],[365,11,365,12],[366,11,366,12],[367,11,367,12],[379,11,379,12],[380,11,380,12],[381,11,381,12],[376,11,376,12],[377,11,377,12],[378,11,378,12],[400,11,400,14],[375,11,375,12],[397,11,397,12],[398,11,398,12],[399,11,399,12],[418,11,418,12],[419,11,419,12],[420,11,420,12],[421,11,421,12],[466,11,466,12],[449,11,449,12],[425,11,425,12],[424,11,424,12],[429,11,429,12],[454,11,454,12],[455,11,455,12],[451,11,451,12],[452,11,452,12],[453,11,453,12],[465,11,465,12],[470,11,470,12],[467,11,467,12],[468,11,468,12],[469,11,469,12],[404,11,404,12],[405,11,405,12],[422,11,422,12],[406,11,406,12],[407,11,407,12],[408,11,408,12],[409,11,409,12],[410,11,410,12],[411,11,411,12],[412,11,412,12],[413,11,413,12],[414,11,414,12],[415,11,415,12],[416,11,416,12],[417,11,417,12],[450,11,450,14],[447,11,447,12],[448,11,448,12],[423,11,423,12],[456,11,456,12],[457,11,457,12],[458,11,458,12],[459,11,459,12],[460,11,460,12],[461,11,461,12],[462,11,462,12],[463,11,463,12],[464,11,464,12],[481,11,481,12],[476,11,476,12],[477,11,477,12],[478,11,478,12],[471,11,471,12],[501,11,501,12],[502,11,502,12],[503,11,503,12],[497,6,500,6],[497,11,497,12],[498,11,498,12],[499,11,499,12],[490,4,490,13],[493,2,493,7],[493,10,493,15],[483,1,487,8],[486,11,486,12],[475,11,475,12],[472,11,472,12],[479,11,479,12],[480,11,480,12],[473,11,473,12],[474,11,474,12],[523,11,523,12],[518,11,518,12],[519,11,519,12],[520,11,520,12],[521,11,521,12],[500,11,500,14],[504,11,504,12],[505,11,505,12],[522,11,522,12],[506,11,506,12],[507,11,507,12],[508,11,508,12],[509,11,509,12],[510,11,510,12],[511,11,511,12],[512,11,512,12],[513,11,513,12],[514,11,514,12],[515,11,515,12],[516,11,516,12],[517,11,517,12],[524,11,524,12],[527,11,527,12],[528,11,528,12],[526,11,526,12],[525,11,525,12],[547,11,547,12],[548,11,548,12],[549,11,549,12],[529,11,529,12],[530,11,530,12],[531,11,531,12],[540,4,540,13],[543,2,543,7],[543,10,543,15],[533,1,537,8],[536,11,536,12],[551,11,551,12],[552,11,552,12],[553,11,553,12],[573,11,573,12],[574,11,574,12],[570,11,570,12],[571,11,571,12],[550,11,550,14],[568,11,568,12],[569,11,569,12],[627,11,627,12],[628,11,628,12],[579,11,579,12],[580,11,580,12],[581,11,581,12],[576,11,576,12],[577,11,577,12],[578,11,578,12],[556,11,556,12],[557,11,557,12],[558,11,558,12],[559,11,559,12],[560,11,560,12],[561,11,561,12],[562,11,562,12],[563,11,563,12],[564,11,564,12],[565,11,565,12],[566,11,566,12],[567,11,567,12],[586,11,586,12],[601,11,601,12],[602,11,602,12],[603,11,603,12],[597,11,597,12],[598,11,598,12],[599,11,599,12],[623,11,623,12],[621,11,621,12],[600,11,600,14],[618,11,618,12],[619,11,619,12],[620,11,620,12],[647,11,647,12],[648,11,648,12],[649,11,649,12],[625,11,625,12],[604,11,604,12],[605,11,605,12],[622,11,622,12],[606,11,606,12],[607,11,607,12],[608,11,608,12],[609,11,609,12],[610,11,610,12],[611,11,611,12],[612,11,612,12],[613,11,613,12],[614,11,614,12],[615,11,615,12],[616,11,616,12],[617,11,617,12],[624,11,624,12],[629,11,629,12],[630,11,630,12],[631,11,631,12],[626,11,626,12],[650,11,650,14],[654,11,654,12],[655,11,655,12],[672,11,672,12],[656,11,656,12],[657,11,657,12],[658,11,658,12],[659,11,659,12],[660,11,660,12],[661,11,661,12],[662,11,662,12],[663,11,663,12],[664,11,664,12],[665,11,665,12],[666,11,666,12],[667,11,667,12],[707,11,707,12],[708,11,708,12],[709,11,709,12],[710,11,710,12],[711,11,711,12],[712,11,712,12],[713,11,713,12],[651,11,651,12],[652,11,652,12],[653,11,653,12],[673,11,673,12],[674,11,674,12],[705,11,705,12],[697,11,697,12],[698,11,698,12],[699,11,699,12],[727,11,727,12],[728,11,728,12],[751,11,751,12],[752,11,752,12],[753,11,753,12],[717,11,717,12],[724,11,724,12],[779,11,779,12],[780,11,780,12],[718,11,718,12],[719,11,719,12],[773,11,773,12],[774,11,774,12],[775,11,775,12],[720,11,720,12],[721,11,721,12],[747,11,747,12],[748,11,748,12],[749,11,749,12],[729,11,729,12],[722,11,722,12],[766,11,766,12],[767,11,767,12],[768,11,768,12],[806,11,806,12],[807,11,807,12],[808,11,808,12],[809,11,809,12],[810,11,810,12],[801,11,801,12],[802,11,802,12],[803,11,803,12],[804,11,804,12],[966,11,966,12],[967,11,967,12],[879,11,879,12],[880,11,880,12],[906,11,906,12],[954,11,954,12],[955,11,955,12],[947,6,950,6],[947,11,947,12],[948,11,948,12],[949,11,949,12],[923,11,923,12],[924,11,924,12],[925,11,925,12],[904,11,904,12],[905,11,905,12],[922,11,922,12],[912,11,912,12],[913,11,913,12],[914,11,914,12],[915,11,915,12],[916,11,916,12],[917,11,917,12],[918,11,918,12],[960,11,960,12],[961,11,961,12],[817,11,817,12],[820,11,820,12],[962,11,962,12],[963,11,963,12],[950,11,950,14],[940,4,940,13],[943,2,943,7],[943,10,943,15],[919,11,919,12],[920,11,920,12],[921,11,921,12],[907,11,907,12],[847,6,850,6],[847,11,847,12],[848,11,848,12],[849,11,849,12],[873,11,873,12],[874,11,874,12],[875,11,875,12],[854,11,854,12],[855,11,855,12],[872,11,872,12],[964,11,964,12],[965,11,965,12],[979,11,979,12],[980,11,980,12],[972,11,972,12],[956,11,956,12],[957,11,957,12],[770,11,770,12],[771,11,771,12],[813,11,813,12],[814,11,814,12],[821,11,821,12],[852,11,852,12],[776,11,776,12],[777,11,777,12],[778,11,778,12],[908,11,908,12],[909,11,909,12],[910,11,910,12],[929,11,929,12],[930,11,930,12],[931,11,931,12],[968,11,968,12],[969,11,969,12],[769,11,769,12],[981,11,981,12],[976,11,976,12],[977,11,977,12],[978,11,978,12],[973,11,973,12],[974,11,974,12],[975,11,975,12],[901,11,901,12],[902,11,902,12],[903,11,903,12],[926,11,926,12],[927,11,927,12],[928,11,928,12],[953,11,953,12],[958,11,958,12],[959,11,959,12],[951,11,951,12],[952,11,952,12],[970,11,970,12],[971,11,971,12],[822,11,822,12],[815,11,815,12],[816,11,816,12],[757,11,757,12],[758,11,758,12],[759,11,759,12],[760,11,760,12],[761,11,761,12],[762,11,762,12],[763,11,763,12],[764,11,764,12],[765,11,765,12],[983,1,987,8],[9,2,9,7],[9,10,9,15],[911,11,911,12],[829,11,829,12],[830,11,830,12],[831,11,831,12],[826,11,826,12],[827,11,827,12],[828,11,828,12],[851,11,851,12],[800,11,800,14],[850,11,850,14],[900,11,900,14],[805,11,805,12],[823,11,823,12],[824,11,824,12],[825,11,825,12],[811,11,811,12],[812,11,812,12],[754,11,754,12],[755,11,755,12],[772,11,772,12],[756,11,756,12],[818,11,818,12],[819,11,819,12],[781,11,781,12],[833,1,837,8],[883,1,887,8],[933,1,937,8],[871,11,871,12],[856,11,856,12],[857,11,857,12],[858,11,858,12],[859,11,859,12],[860,11,860,12],[861,11,861,12],[862,11,862,12],[863,11,863,12],[864,11,864,12],[865,11,865,12],[866,11,866,12],[867,11,867,12],[853,11,853,12],[797,6,800,6],[797,11,797,12],[798,11,798,12],[799,11,799,12]]}
[]
["STATE OF SOUTH CAROLINA"]
["GRANTS ACTIVITY FORM"]
[null,null,null,null,null,null,null,null,"AT JUNE 30,",2019]
[]
[]
[null,"Agency:",{"$f":"'Signature 1'!E5","v":"E120"},null,{"$f":"'Signature 1'!E6","v":"COMPTROLLER GENERAL'S OFFICE\n"}]
[null,null,"Business Area","Name"]
[]
[null,"Preparer:","Employee ABC",null,null,null,null,null,null,"Reviewer:","Supervisor XYZ"]
[null,null,null,"Typed Name",null,null,null,null,null,null,null,"Typed Name"]
[]
[]
[null,null,null,"Grantor's",null,null,"Eligibility ?","Beginning","(+)","(-)","Ending","(-)",null,"Other","June 30"]
[null,"Fund","SCEIS","Award",null,"Grant",null,"Fund","Grant Receipts","Grant Qualified","Fund","Accounts Payable",null,"Accrual","Accrual"]
{"$rows_left_out":973}
{"sheet":"3.03.2","index":3,"n_rows":59,"n_cols":24,"rows_kept":59,"cut":false,"hidden":false,"merged":[[57,23,57,24],[58,23,58,24],[46,23,46,24],[49,23,49,24],[50,23,50,24],[51,23,51,24],[52,23,52,24],[53,23,53,24],[54,23,54,24],[55,23,55,24],[56,23,56,24],[37,23,37,24],[38,23,38,24],[39,23,39,24],[40,23,40,24],[41,23,41,24],[42,23,42,24],[43,23,43,24],[44,23,44,24],[45,23,45,24],[25,23,25,24],[26,23,26,24],[27,23,27,24],[28,23,28,24],[29,23,29,24],[30,23,30,24],[31,23,31,24],[32,23,32,24],[36,23,36,24],[13,23,14,24],[18,23,18,24],[19,23,19,24],[20,23,20,24],[21,23,21,24],[22,23,22,24],[23,23,23,24],[24,23,24,24],[14,8,14,9],[37,8,37,9],[27,8,27,9],[27,12,27,13],[27,16,27,17],[19,8,19,9],[37,20,37,21],[38,8,38,9],[38,12,38,13],[38,16,38,17],[38,20,38,21],[24,12,24,13],[27,20,27,21],[28,8,28,9],[28,12,28,13],[28,16,28,17],[28,20,28,21],[25,20,25,21],[26,20,26,21],[7,7,7,16],[18,16,18,17],[43,12,43,13],[43,16,43,17],[19,16,19,17],[23,16,23,17],[29,8,29,9],[29,12,29,13],[29,16,29,17],[30,8,30,9],[30,12,30,13],[30,16,30,17],[31,8,31,9],[31,12,31,13],[31,16,31,17],[14,12,14,13],[18,8,18,9],[18,12,18,13],[25,16,25,17],[26,16,26,17],[10,4,10,10],[10,13,10,21],[39,8,39,9],[39,12,39,13],[40,8,40,9],[40,12,40,13],[43,20,43,21],[40,16,40,17],[14,15,14,18],[14,20,14,21],[18,20,18,21],[36,8,36,9],[36,12,36,13],[36,16,36,17],[36,20,36,21],[25,12,25,13],[26,12,26,13],[32,12,32,13],[29,20,29,21],[30,20,30,21],[31,20,31,21],[19,12,19,13],[20,12,20,13],[21,12,21,13],[22,12,22,13],[23,12,23,13],[39,16,39,17],[39,20,39,21],[41,20,41,21],[42,8,42,9],[42,12,42,13],[42,16,42,17],[42,20,42,21],[43,8,43,9],[41,12,41,13],[49,8,49,9],[49,12,49,13],[58,8,58,9],[50,12,50,13],[51,12,51,13],[52,12,52,13],[53,12,53,13],[54,12,54,13],[32,16,32,17],[32,20,32,21],[50,8,50,9],[51,8,51,9],[52,8,52,9],[53,8,53,9],[49,20,49,21],[45,8,45,9],[45,12,45,13],[45,16,45,17],[45,20,45,21],[32,8,32,9],[44,8,44,9],[53,16,53,17],[54,16,54,17],[55,16,55,17],[41,16,41,17],[37,12,37,13],[54,8,54,9],[55,8,55,9],[19,20,19,21],[20,16,20,17],[20,20,20,21],[21,16,21,17],[21,20,21,21],[22,16,22,17],[22,20,22,21],[20,8,20,9],[21,8,21,9],[22,8,22,9],[23,8,23,9],[24,8,24,9],[25,8,25,9],[26,8,26,9],[23,20,23,21],[24,16,24,17],[24,20,24,21],[44,12,44,13],[44,16,44,17],[44,20,44,21],[40,20,40,21],[41,8,41,9],[58,12,58,13],[50,16,50,17],[56,8,56,9],[57,8,57,9],[57,20,57,21],[58,20,58,21],[13,8,13,17],[56,16,56,17],[57,16,57,17],[58,16,58,17],[50,20,50,21],[51,20,51,21],[52,20,52,21],[53,20,53,21],[54,20,54,21],[55,20,55,21],[56,20,56,21],[55,12,55,13],[56,12,56,13],[57,12,57,13],[49,16,49,17],[37,16,37,17],[51,16,51,17],[52,16,52,17]]}
[]
[null,"STATE OF SOUTH CAROLINA"]
[null,"GRANTS RECEIVABLES AND DEFERRED REVENUE"]
[null,"SUMMARY FORM"]
[null,null,null,null,null,null,null,null,null,null,null,"AT JUNE 30,",{"$f":"IF('3.03.1'!J4=\"\",\"\",'3.03.1'!J4)","v":2019}]
[]
[]
[null,null,"Agency:",null,{"$f":"IF('3.03.1'!C7=\"\",\"\",'3.03.1'!C7)","v":"E120"},null,null,{"$f":"+'Signature 1'!E6","v":"COMPTROLLER GENERAL'S OFFICE\n"}]
[null,null,null,null,"Business Area",null,null,null,null,null,null,null,"Name"]
[]
[null,null,"Preparer:",null,"Employee ABC",null,null,null,null,null,null,null,"Reviewer:","Supervisor XYZ"]
[null,null,null,null,null,"Typed Name",null,null,null,null,null,null,null,null,null,null,"Typed Name"]
[]
[null,null,null,null,null,null,null,null,"Receivable Balances",null,null,null,null,null,null,null,null,null,null,null,null,null,null,"Accounts Payable"]
[null,null,"Fund No",null,"Account Description",null,null,null,"Total",null,null,null,"Current",null,null,"Non-Current",null,null,null,null,"Deferred Revenue"]
{"$rows_left_out":45}
{"sheet":"3.03.3","index":4,"n_rows":59,"n_cols":21,"rows_kept":59,"cut":false,"hidden":false,"merged":[[13,8,13,17],[14,8,14,9],[14,12,14,13],[14,15,14,18],[7,7,7,16],[14,20,14,21],[18,8,18,9],[18,12,18,13],[18,16,18,17],[18,20,18,21],[10,4,10,10],[10,13,10,21],[19,8,19,9],[19,12,19,13],[19,16,19,17],[19,20,19,21],[22,8,22,9],[22,12,22,13],[22,16,22,17],[22,20,22,21],[23,8,23,9],[23,12,23,13],[23,16,23,17],[23,20,23,21],[20,8,20,9],[20,12,20,13],[20,16,20,17],[20,20,20,21],[21,8,21,9],[21,12,21,13],[21,16,21,17],[21,20,21,21],[26,16,26,17],[26,20,26,21],[27,8,27,9],[27,12,27,13],[27,16,27,17],[27,20,27,21],[24,8,24,9],[24,12,24,13],[24,16,24,17],[24,20,24,21],[25,8,25,9],[25,12,25,13],[25,16,25,17],[25,20,25,21],[30,20,30,21],[31,8,31,9],[31,12,31,13],[31,16,31,17],[31,20,31,21],[28,8,28,9],[28,12,28,13],[28,16,28,17],[28,20,28,21],[29,8,29,9],[29,12,29,13],[29,16,29,17],[29,20,29,21],[37,20,37,21],[38,8,38,9],[38,12,38,13],[38,16,38,17],[38,20,38,21],[32,8,32,9],[32,12,32,13],[32,16,32,17],[32,20,32,21],[36,8,36,9],[36,12,36,13],[36,16,36,17],[36,20,36,21],[41,20,41,21],[42,8,42,9],[42,12,42,13],[42,16,42,17],[42,20,42,21],[39,8,39,9],[39,12,39,13],[39,16,39,17],[39,20,39,21],[40,8,40,9],[40,12,40,13],[40,16,40,17],[40,20,40,21],[45,20,45,21],[49,8,49,9],[49,12,49,13],[49,16,49,17],[49,20,49,21],[43,8,43,9],[43,12,43,13],[43,16,43,17],[43,20,43,21],[44,8,44,9],[44,12,44,13],[44,16,44,17],[44,20,44,21],[52,20,52,21],[53,8,53,9],[53,12,53,13],[53,16,53,17],[53,20,53,21],[50,8,50,9],[50,12,50,13],[50,16,50,17],[50,20,50,21],[51,8,51,9],[51,12,51,13],[51,16,51,17],[51,20,51,21],[58,20,58,21],[18,4,18,5],[19,4,19,5],[20,4,20,5],[21,4,21,5],[22,4,22,5],[56,8,56,9],[56,12,56,13],[56,16,56,17],[56,20,56,21],[57,8,57,9],[57,12,57,13],[57,16,57,17],[57,20,57,21],[54,8,54,9],[54,12,54,13],[54,16,54,17],[54,20,54,21],[55,8,55,9],[55,12,55,13],[55,16,55,17],[55,20,55,21],[52,8,52,9],[52,12,52,13],[23,4,23,5],[24,4,24,5],[25,4,25,5],[26,4,26,5],[27,4,27,5],[28,4,28,5],[58,8,58,9],[58,12,58,13],[58,16,58,17],[52,16,52,17],[45,8,45,9],[45,12,45,13],[45,16,45,17],[41,8,41,9],[41,12,41,13],[41,16,41,17],[37,8,37,9],[37,12,37,13],[37,16,37,17],[30,8,30,9],[30,12,30,13],[30,16,30,17],[26,8,26,9],[26,12,26,13],[38,4,38,5],[39,4,39,5],[40,4,40,5],[41,4,41,5],[42,4,42,5],[43,4,43,5],[29,4,29,5],[30,4,30,5],[31,4,31,5],[32,4,32,5],[36,4,36,5],[37,4,37,5],[53,4,53,5],[54,4,54,5],[55,4,55,5],[56,4,56,5],[57,4,57,5],[58,4,58,5],[44,4,44,5],[45,4,45,5],[49,4,49,5],[50,4,50,5],[51,4,51,5],[52,4,52,5]]}
[]
[null,"STATE OF SOUTH CAROLINA"]
[null,"CONTRIBUTIONS RECEIVABLES AND DEFERRED REVENUE"]
[null,"SUMMARY FORM"]
[null,null,null,null,null,null,null,null,null,null,null,"AT JUNE 30,",{"$f":"IF('3.03.1'!J4=\"\",\"\",'3.03.1'!J4)","v":2019}]
[]
[]
[null,null,"Agency:",null,{"$f":"+'3.03.1'!C7","v":"E120"},null,null,{"$f":"+'Signature 1'!E6","v":"COMPTROLLER GENERAL'S OFFICE\n"}]
[null,null,null,null,"Business Area",null,null,null,null,null,null,null,"Name"]
[]
[null,null,"Preparer:",null,"Employee ABC",null,null,null,null,null,null,null,"Reviewer:","Supervisor XYZ"]
[null,null,null,null,null,"Typed Name",null,null,null,null,null,null,null,null,null,null,"Typed Name"]
[]
[null,null,null,null,null,null,null,null,"Receivable Balances"]
[null,null,"Fund No",null,"Revenue GL Account",null,null,null,"Total",null,null,null,"Current",null,null,"Non-Current",null,null,null,null,"Deferred Revenue"]
{"$rows_left_out":45}
{"sheet":"3.03.4","index":5,"n_rows":95,"n_cols":11,"rows_kept":95,"cut":false,"hidden":false,"merged":[]}
["STATE OF SOUTH CAROLINA"]
["GRANTS AND CONTRIBUTION REVENUES REPORTING PACKAGE"]
["REVIEWER CHECKLIST"]
[null,null,null,null,null,"FISCAL YEAR",{"$f":"IF('3.03.1'!J4=\"\",IF('3.03.3'!M5=\"\",\"\",'3.03.3'!M5),'3.03.1'!J4)","v":2019}]
[]
["Agency:",null,{"$f":"+'3.03.1'!C7","v":"E120"}]
[]
[null,null,null,null,"Date Last Review Step Was Completed:   ","2019-09-09"]
[]
[]
["Reviewer's Responses:"]
[{"$f":"COUNT(A$11:A11)+1","v":1},"Is the reviewer of the form someone other than the person who prepared it?",null,null,null,null,null,null,null,null,"Yes"]
[]
[{"$f":"COUNT(A$11:A13)+1","v":2},"Can all amounts reported on each form be traced to official agency accounting "]
[null,"records?",null,null,null,null,null,null,null,null,"Yes"]
{"$rows_left_out":80}