{"text_format":"1","workbook":"xlsx","n_sheets":10,"sheets":["Yearly Data","Instructions","Signature Page","2.0.1","Required Packages","Resources","Summary","37. (Cont)","42. (Cont)","44. (Cont)"],"not_rendered":{"charts":0,"images":0,"macros":1,"external_links":0,"defined_names":3,"comments":0,"pivot_tables":0},"unopened":[],"bounds":{"document_bytes":16777216,"sheet_cells":100000,"rows_first":2000,"rows_last":500,"rows_between":2000,"halvings":0,"cell_chars":16384,"cell_head_chars":4096},"cells_cut":0,"cells_raw":0,"read":"whole","date_system":"1900"}

{"sheet":"Yearly Data","index":0,"n_rows":87,"n_cols":3,"rows_kept":87,"cut":false,"hidden":true,"merged":[]}
["Year",2019]
[]
[]
["The following information must be reviewed and updated as necessary anually:"]
[]
["AGCY  CODE","AGENCY NAME","FY Added"]
["A010","LEGISLATIVE DEPARTMENT - THE SENATE"]
["A050","LEGISLATIVE DEPARTMENT - HOUSE OF REPRESENTATIVES"]
["A150","LEGISLATIVE DEPARTMENT - CODIFICATION OF LAWS & LEGISLATIVE COUNCIL"]
["A170","LEGISLATIVE DEPARTMENT - LEGISLATIVE SERVICES AGENCY"]
["A200","LEGISLATIVE DEPARTMENT - LEGISLATIVE AUDIT COUNCIL"]
["A850","EDUCATION OVERSIGHT COMMITTEE"]
["B040","JUDICIAL DEPARTMENT"]
["C050","ADMINISTRATIVE LAW JUDGES"]
["D050","GOVERNOR'S OFFICE--EXECUTIVE CONTROL OF STATE"]
["D100","GOVERNOR'S OFFICE--STATE LAW ENFORCEMENT DIVISION"]
["D170","GOVERNOR'S OFFICE-- EXECUTIVE POLICY & PROGRAMS"]
["D200","GOVERNOR'S OFFICE--MANSION & GROUNDS"]
["D250","INSPECTOR GENERAL"]
["D500","DEPARTMENT OF ADMINSTRATION"]
{"$rows_left_out":68}
{"sheet":"Instructions","index":1,"n_rows":108,"n_cols":10,"rows_kept":108,"cut":false,"hidden":false,"merged":[]}
["MASTER REPORTING PACKAGE CHECKLIST"]
["INSTRUCTIONS FOR COMPLETION"]
["Form 2.0.1"]
[]
[]
[null,"PURPOSE AND OBJECTIVES"]
[null,"The purpose of this year-end reporting package is to help agencies determine which reporting packages"]
[null,"are required.  It also tells the Comptroller General's Office which reporting packages to expect from"]
[null,"an agency."]
[]
[null,"THIS FORM SHOULD NOT BE COMPLETED BY THE FOLLOWING:"]
[null,"Exempt entities:"]
[null,"F30 Employee Benefits Fund"]
[null,"F31 Capital Expenditure Fund"]
[null,"Audited Financial Statement Entities:"]
[null,"Department of Employment Workforce (Unemployment Compensation Benefits Fund Only)"]
[null,"Colleges, Universities, and Technical Colleges"]
[null,"Children's Trust of South Carolina"]
[null,"Department of Commerce, Division of Public Railways"]
[null,"Department of Commerce, Division of Savannah Valley Development"]
{"$rows_left_out":89}
{"sheet":"Signature Page","index":2,"n_rows":40,"n_cols":6,"rows_kept":40,"cut":false,"hidden":false,"merged":[[39,1,39,5],[25,3,25,4],[27,0,27,5],[31,1,31,5],[33,1,33,5],[35,1,35,5],[37,1,37,5]]}
[null,null,"Master Reporting Checklist Signature Page"]
[]
[]
[null,null,"CAFR Reporting Period:",null,{"$f":"Year","v":2019}]
[null,null,"Agency Number:",null,"ZZZZ",{"$f":"IF(AgencyCode=\"\",\"*\",\"\")","v":""}]
[null,null,"Agency Name",null,{"$f":"IF(ISERROR(VLOOKUP(E5,'Yearly Data'!A7:B87,2,FALSE))=TRUE,\"\",VLOOKUP(E5,'Yearly Data'!A7:B87,2,FALSE))","v":"EXAMPLE AGENCY"}]
[]
[]
[]
[null,null,"Preparer","Date:","Joe Preparer",{"$f":"IF(E10=\"\",\"*\",\"\")","v":""}]
[null,null,null,"Name:","Accountant",{"$f":"IF(E11=\"\",\"*\",\"\")","v":""}]
[null,null,null,"Title:","2019-07-03",""]
[null,null,null,"e-mail:","jpreparer@example.sc.gov",""]
[null,null,null,"Phone Number:","(803) 123-4567",""]
[null,null,null,"Signature:",null,"*"]
[]
[null,null,"Reviewer","Date:","2019-07-05",{"$f":"IF(E17=\"\",\"*\",\"\")","v":""}]
[null,null,null,"Name:","Tome Reviewer",""]
[null,null,null,"Title:","Manager",""]
[null,null,null,"e-mail:","treviewer@example.sc.gov",""]
{"$rows_left_out":21}
{"sheet":"2.0.1","index":3,"n_rows":480,"n_cols":7,"rows_kept":480,"cut":false,"hidden":false,"merged":[[19,2,19,5],[12,2,12,5],[13,2,13,5],[15,2,15,5],[16,2,16,5],[17,2,17,5],[18,2,18,5],[11,2,11,5],[5,2,5,6],[6,2,6,5],[7,2,7,5],[9,2,9,5],[10,2,10,5]]}
[null,null,"STATE OF SOUTH CAROLINA"]
[null,null,"YEAR-END REPORTING PACKAGE "]
[null,null,"MASTER REPORTING CHECKLIST"]
[null,null,{"$f":"\"For the Fiscal Year Ended June 30, \"&Year","v":"For the Fiscal Year Ended June 30, 2019"}]
[]
[null,null,"The information in this box is linked from the Signature Page. Complete the Signature Page to populate these fields."]
["Agency:",null,{"$f":"IF(AgencyCode=\"\",\"\",AgencyCode)","v":"ZZZZ"}]
[null,null,{"$f":"IF(AgencyName=\"\",\"\",AgencyName)","v":"EXAMPLE AGENCY"}]
[]
["Preparer",null,{"$f":"IF('Signature Page'!E11=\"\",\"\",'Signature Page'!E11)","v":"Accountant"}]
["Title",null,{"$f":"IF('Signature Page'!E12=\"\",\"\",'Signature Page'!E12)","v":43649}]
["Date",null,{"$f":"IF('Signature Page'!E10=\"\",\"\",'Signature Page'!E10)","v":"Joe Preparer"}]
["email:",null,{"$f":"IF('Signature Page'!E13=\"\",\"\",'Signature Page'!E13)","v":"jpreparer@example.sc.gov"}]
["Phone:",null,{"$f":"IF('Signature Page'!E14=\"\",\"\",'Signature Page'!E14)","v":"(803) 123-4567"}]
[]
["Reviewer",null,{"$f":"IF('Signature Page'!E18=\"\",\"\",'Signature Page'!E18)","v":"Tome Reviewer"}]
["Title",null,{"$f":"IF('Signature Page'!E19=\"\",\"\",'Signature Page'!E19)","v":"Manager"}]
["Date",null,{"$f":"IF('Signature Page'!E17=\"\",\"\",'Signature Page'!E17)","v":"2019-07-05"}]
["email:",null,{"$f":"IF('Signature Page'!E20=\"\",\"\",'Signature Page'!E20)","v":"treviewer@example.sc.gov"}]
["Phone:",null,{"$f":"IF('Signature Page'!E21=\"\",\"\",'Signature Page'!E21)","v":"(803) 765-4321"}]
{"$rows_left_out":461}
{"sheet":"Required Packages","index":4,"n_rows":116,"n_cols":6,"rows_kept":116,"cut":false,"hidden":false,"merged":[[55,1,55,3],[5,0,5,5],[0,0,0,4],[1,0,1,4],[2,0,2,4],[3,0,3,4]]}
["STATE OF SOUTH CAROLINA"]
["YEAR-END REPORTING PACKAGE "]
["SUMMARY OF REQUIRED PACKAGES AND ADDITIONAL DOCUMENTATION"]
[{"$f":"\"For the Fiscal Year Ended June 30, \"&Year","v":"For the Fiscal Year Ended June 30, 2019"}]
[]
[{"$f":"\"For\"&\" \"&AgencyCode&\", \"&AgencyName","v":"For ZZZZ, EXAMPLE AGENCY"}]
[]
["Package Number",null,null,null,"Required Package/Sheet"]
[]
[2.0099999999999998,"Subsequent Events Reporting Package",null,null,{"$f":"IF(OR(F66=\"Yes\",F67=\"Yes\")=FALSE,\"Not Required\",\"Due\"&\" \"&Resources!D4&\" but not before \"&Resources!E4)","v":"Due 10/21/2019 but not before 10/7/2019"}]
[3.01,"Cash and Investments Reporting Package",null,null,{"$f":"IF(OR(F12=\"Yes\",F13=\"Yes\",F14=\"Yes\")=FALSE,\"Not Required\",\"Due\"&\" \"&Resources!D5)","v":"Due 7/19/2019"}]
[null,null,"3.01.1","Petty Cash",null,{"$f":"IF('2.0.1'!G45=\"Yes\",\"Yes\",IF('2.0.1'!G45=\"No\",\"No\",IF('2.0.1'!G45=\"\",\"\",\"ERROR\")))","v":"Yes"}]
[null,null,"3.01.2","Agency Cash",null,{"$f":"IF('2.0.1'!G50=\"Yes\",\"Yes\",IF('2.0.1'!G50=\"No\",\"No\",IF('2.0.1'!G50=\"\",\"\",\"ERROR\")))","v":"Yes"}]
[null,null,"3.01.3","Investments",null,{"$f":"IF('2.0.1'!G55=\"Yes\",\"Yes\",IF('2.0.1'!G55=\"No\",\"No\",IF('2.0.1'!G55=\"\",\"\",\"ERROR\")))","v":"Yes"}]
[3.02,"Tax Revenue Reporting Package",null,null,{"$f":"IF(OR(F16=\"Yes\",F17=\"Yes\",F18=\"Yes\")=FALSE,\"Not Required\",\"Due\"&\" \"&Resources!D6)","v":"Not Required"}]
[null,null,"3.02.1","Tax Receivable",null,{"$f":"IF('2.0.1'!G60=\"Yes\",\"Yes\",IF('2.0.1'!G60=\"No\",\"No\",IF('2.0.1'!G60=\"\",\"\",\"ERROR\")))","v":"No"}]
[null,null,"3.02.2","Tax Refund Payable",null,{"$f":"IF('2.0.1'!G60=\"Yes\",\"Yes\",IF('2.0.1'!G60=\"No\",\"No\",IF('2.0.1'!G60=\"\",\"\",\"ERROR\")))","v":"No"}]
[null,null,"3.02.3","Deferred Tax Revenues",null,{"$f":"IF('2.0.1'!G60=\"Yes\",\"Yes\",IF('2.0.1'!G60=\"No\",\"No\",IF('2.0.1'!G60=\"\",\"\",\"ERROR\")))","v":"No"}]
[3.03,"Grants and Contribution Revenue Reporting Package",null,null,{"$f":"IF(OR(F20=\"Yes\",F21=\"Yes\",F22=\"Yes\")=FALSE,\"Not Required\",\"Due\"&\" \"&Resources!D7)","v":"Due 9/13/2019"}]
[null,null,"3.03.1","Grants Activity Form",null,{"$f":"IF('2.0.1'!G70=\"Yes\",\"Yes\",IF('2.0.1'!G70=\"No\",\"No\",IF('2.0.1'!G70=\"\",\"\",\"ERROR\")))","v":"Yes"}]
{"$rows_left_out":97}
{"sheet":"Resources","index":5,"n_rows":22,"n_cols":9,"rows_kept":22,"cut":false,"hidden":false,"merged":[[1,2,1,3],[1,7,1,8],[14,0,15,0],[14,1,15,1],[14,2,15,2],[14,3,15,3],[14,5,15,5]]}
[]
["Package","Package Name","Package Due Day & Date",null,"Not Before","CG's Office Contact","Phone Number","SCEIS Report Name & Date Report is Scheduled to be Sent"]
[2,"Master Reporting Checklist",{"$f":"TEXT(D3,\"dddd\")","v":"Friday"},"7/5/2019",null,"John Morrison","803-734-5043"]
[2.0099999999999998,"Subsequent Event ","Monday","10/21/2019","10/7/2019","Laura Showe","803-734-4178"]
[3.01,"Cash and Investments","Friday","7/19/2019",null,"John Morrison","803-734-5043","Yearend Rptg - Cash & Investments","2019-07-12"]
[3.02,"Tax Revenue","Friday","8/9/2019",null,"John Morrison","803-734-5043"]
[3.03,"Grant and Contributions Revenue","Friday","9/13/2019",null,"Laura Showe","803-734-4178","Yearend Rptg - AR (Contributions)\nYearend Rptg - Schedule of Expenditures of Fed Awards (SEFA)","2019-09-03"]
[3.04,"Other Receivables","Friday","8/9/2019",null,"Kelly Ghent","803-734-0272","Yearend Rptg – Accounts Receivable Current with Customer","2019-08-01"]
[3.05,"Unearned Revenue","Friday","8/23/2019",null,"Kelly Ghent","803-734-0272"]
[3.06,"Inventory","Friday","8/9/2019",null,"Kelly Ghent","803-734-0272","Yearend Rptg - AR (Contributions)","2019-08-01"]
[3.07,"Prepaid Expenses","Friday","8/23/2019",null,"Kelly Ghent","803-734-0272","Yearend Rptg - Prepaid Expenses","2019-08-09"]
[3.08,"Capital Assets","Friday","9/13/2019",null,"Laura Showe","803-734-4178","Yearend Rptg - Asset History Sheet","2019-09-03"]
[3.09,"Operating Leases","Friday","8/23/2019",null,"Laura Showe","803-734-4178","Yearend Rptg - Operating Lease Expense w/Vendor","2019-08-09"]
[3.1,"Loans Receivable","Friday","7/19/2019",null,"John Morrison","803-734-5043"]
[3.12,"Accounts Payable","Friday","9/13/2019",null,"Kelly Ghent","803-734-0272","Yearend Rptg - Prior Year Payables with Vendor","2019-09-03"]
[null,null,null,null,null,null,"803-734-0272","Yearend Rptg - Prior Year Payables with Vendor","2019-09-11"]
[3.13,"Litigation","Friday","7/19/2019",null,"Laura Showe","803-734-4178","Yearend Rpt - Litigation Expense","2019-07-12"]
[3.14,"Disallowances and Penalties","Friday","7/19/2019",null,"Kelly Ghent","803-734-0272"]
[3.15,"Claims","Friday","8/9/2019",null,"David Starkey","803-734-2542"]
[3.16,"Misc Loss Liabilities","Friday","8/9/2019",null,"Laura Showe","803-734-4178"]
{"$rows_left_out":3}
{"sheet":"Summary","index":6,"n_rows":460,"n_cols":7,"rows_kept":460,"cut":false,"hidden":true,"merged":[]}
["Worksheet","Agnecy Code","Agency Name","Year","QUESTION #","QUESTION","Answers"]
["2.0.1",{"$f":"AgencyCode","v":"ZZZZ"},{"$f":"AgencyName","v":"EXAMPLE AGENCY"},{"$f":"Year","v":2019},{"$f":"'2.0.1'!A27","v":1},{"$f":"'2.0.1'!C27","v":"Each agency is responsible for designing and implementing processes, procedures, and controls to record and provide accurate and timely accounting information and to prevent and detect fraud.  As part of Best Practices for Internal Control, a review of the agency's general ledger either in detail or at a trial balance level should be performed at the beginning of the yearly closing procedures."},{"$f":"IF('2.0.1'!G27=\"\",\"\",'2.0.1'!G27)","v":""}]
["2.0.1","ZZZZ","EXAMPLE AGENCY",2019,{"$f":"IF('2.0.1'!A29=\"\",E2,'2.0.1'!A29)","v":1},{"$f":"IF('2.0.1'!C29=\"\",\"\",'2.0.1'!C29)","v":"a.  Has a review of general ledger balances been performed at an agency wide level? "},{"$f":"IF('2.0.1'!G29=\"\",\"\",'2.0.1'!G29)","v":"Yes"}]
["2.0.1","ZZZZ","EXAMPLE AGENCY",2019,{"$f":"IF('2.0.1'!A31=\"\",E3,'2.0.1'!A31)","v":1},{"$f":"IF('2.0.1'!C31=\"\",\"\",'2.0.1'!C31)","v":"b.  Were any errors identified in the review performed for the beginning of year-end close for the current year ended June 30?"},{"$f":"IF('2.0.1'!G31=\"\",\"\",'2.0.1'!G31)","v":"No"}]
["2.0.1","ZZZZ","EXAMPLE AGENCY",2019,{"$f":"IF('2.0.1'!A33=\"\",E4,'2.0.1'!A33)","v":1},{"$f":"IF('2.0.1'!C33=\"\",\"\",'2.0.1'!C33)","v":"Action:  Perform sufficient analysis and evaluation to identify and correct the errors prior to submission of related reporting package forms and the close of access to the general ledger.  "},{"$f":"IF('2.0.1'!G33=\"\",\"\",'2.0.1'!G33)","v":""}]
["2.0.1","ZZZZ","EXAMPLE AGENCY",2019,{"$f":"IF('2.0.1'!A36=\"\",E5,'2.0.1'!A36)","v":2},{"$f":"IF('2.0.1'!C36=\"\",\"\",'2.0.1'!C36)","v":"As part of Best Practices for Internal Control, a review of the general ledger by detailed fund should be performed at the beginning and ending of the yearly closing procedures."},{"$f":"IF('2.0.1'!G36=\"\",\"\",'2.0.1'!G36)","v":""}]
["2.0.1","ZZZZ","EXAMPLE AGENCY",2019,{"$f":"IF('2.0.1'!A38=\"\",E6,'2.0.1'!A38)","v":2},{"$f":"IF('2.0.1'!C38=\"\",\"\",'2.0.1'!C38)","v":"a.  Has a review of general ledger balances been performed at the accounting (detailed) fund level? "},{"$f":"IF('2.0.1'!G38=\"\",\"\",'2.0.1'!G38)","v":"Yes"}]
["2.0.1","ZZZZ","EXAMPLE AGENCY",2019,{"$f":"IF('2.0.1'!A40=\"\",E7,'2.0.1'!A40)","v":2},{"$f":"IF('2.0.1'!C40=\"\",\"\",'2.0.1'!C40)","v":"b.  Were any errors identified in the review by fund for the beginning of year-end close for the current year ended June 30?"},{"$f":"IF('2.0.1'!G40=\"\",\"\",'2.0.1'!G40)","v":"Yes"}]
["2.0.1","ZZZZ","EXAMPLE AGENCY",2019,{"$f":"IF('2.0.1'!A42=\"\",E8,'2.0.1'!A42)","v":2},{"$f":"IF('2.0.1'!C42=\"\",\"\",'2.0.1'!C42)","v":"Action:  Perform sufficient analysis and evaluation to identify and correct the errors prior to submission of related reporting package forms and the close of access to the general ledger.  "},{"$f":"IF('2.0.1'!G42=\"\",\"\",'2.0.1'!G42)","v":""}]
["2.0.1","ZZZZ","EXAMPLE AGENCY",2019,{"$f":"IF('2.0.1'!A45=\"\",E9,'2.0.1'!A45)","v":3},{"$f":"IF('2.0.1'!C45=\"\",\"\",'2.0.1'!C45)","v":"Is your agency authorized for a petty cash fund, cash on hand, or cash register change fund, collectively referred to as petty cash?  (Do not include a checking account used as petty cash.)"},{"$f":"IF('2.0.1'!G45=\"\",\"\",'2.0.1'!G45)","v":"Yes"}]
["2.0.1","ZZZZ","EXAMPLE AGENCY",2019,{"$f":"IF('2.0.1'!A47=\"\",E10,'2.0.1'!A47)","v":3},{"$f":"IF('2.0.1'!C47=\"\",\"\",'2.0.1'!C47)","v":"Action:  A Cash and Investments Reporting Package is required.  (See Section 3.01)"},{"$f":"IF('2.0.1'!G47=\"\",\"\",'2.0.1'!G47)","v":""}]
["2.0.1","ZZZZ","EXAMPLE AGENCY",2019,{"$f":"IF('2.0.1'!A50=\"\",E11,'2.0.1'!A50)","v":4},{"$f":"IF('2.0.1'!C50=\"\",\"\",'2.0.1'!C50)","v":"Does your agency have cash held in a bank account (including composite reservoir accounts) for which it receives periodic statements directly from the bank (cash on deposit with banks)?"},{"$f":"IF('2.0.1'!G50=\"\",\"\",'2.0.1'!G50)","v":"Yes"}]
["2.0.1","ZZZZ","EXAMPLE AGENCY",2019,{"$f":"IF('2.0.1'!A52=\"\",E12,'2.0.1'!A52)","v":4},{"$f":"IF('2.0.1'!C52=\"\",\"\",'2.0.1'!C52)","v":"Action:  A Cash and Investments Reporting Package is required.  (See Section 3.01)"},{"$f":"IF('2.0.1'!G52=\"\",\"\",'2.0.1'!G52)","v":""}]
["2.0.1","ZZZZ","EXAMPLE AGENCY",2019,{"$f":"IF('2.0.1'!A55=\"\",E13,'2.0.1'!A55)","v":5},{"$f":"IF('2.0.1'!C55=\"\",\"\",'2.0.1'!C55)","v":"Does your agency have ownership in investments that are not managed or accounted for by the State Treasurer's Office? "},{"$f":"IF('2.0.1'!G55=\"\",\"\",'2.0.1'!G55)","v":"Yes"}]
["2.0.1","ZZZZ","EXAMPLE AGENCY",2019,{"$f":"IF('2.0.1'!A57=\"\",E14,'2.0.1'!A57)","v":5},{"$f":"IF('2.0.1'!C57=\"\",\"\",'2.0.1'!C57)","v":"Action:  A Cash and Investments Reporting Package is required.  (See Section 3.01)"},{"$f":"IF('2.0.1'!G57=\"\",\"\",'2.0.1'!G57)","v":""}]
["2.0.1","ZZZZ","EXAMPLE AGENCY",2019,{"$f":"IF('2.0.1'!A60=\"\",E15,'2.0.1'!A60)","v":6},{"$f":"IF('2.0.1'!C60=\"\",\"\",'2.0.1'!C60)","v":"Did your agency collect and deposit any tax revenues during the fiscal year?  (If you collect sales taxes that are remitted to the South Carolina Department of Revenue for items sold in a gift shop, please answer no for this question.)"},{"$f":"IF('2.0.1'!G60=\"\",\"\",'2.0.1'!G60)","v":"No"}]
["2.0.1","ZZZZ","EXAMPLE AGENCY",2019,{"$f":"IF('2.0.1'!A62=\"\",E16,'2.0.1'!A62)","v":6},{"$f":"IF('2.0.1'!C62=\"\",\"\",'2.0.1'!C62)","v":"Action: A Tax Revenues Reporting Package is required.  (See Section 3.02)"},{"$f":"IF('2.0.1'!G62=\"\",\"\",'2.0.1'!G62)","v":""}]
["2.0.1","ZZZZ","EXAMPLE AGENCY",2019,{"$f":"IF('2.0.1'!A65=\"\",E17,'2.0.1'!A65)","v":7},{"$f":"IF('2.0.1'!C65=\"\",\"\",'2.0.1'!C65)","v":"Did your agency receive resources from the federal government or other private granting organizations under an agreement which constitutes the service as a cash conduit (see Reporting Manual for further guidance on what constitutes a cash conduit) during the year?"},{"$f":"IF('2.0.1'!G65=\"\",\"\",'2.0.1'!G65)","v":""}]
["2.0.1","ZZZZ","EXAMPLE AGENCY",2019,{"$f":"IF('2.0.1'!A67=\"\",E18,'2.0.1'!A67)","v":7},{"$f":"IF('2.0.1'!C67=\"\",\"\",'2.0.1'!C67)","v":"Action:  A schedule of the total amount, by fund, passed through to non-State entities (as a cash conduit) is to be returned to the Comptroller General's Office before September 6.  "},{"$f":"IF('2.0.1'!G67=\"\",\"\",'2.0.1'!G67)","v":""}]
["2.0.1","ZZZZ","EXAMPLE AGENCY",2019,{"$f":"IF('2.0.1'!A70=\"\",E19,'2.0.1'!A70)","v":8},{"$f":"IF('2.0.1'!C70=\"\",\"\",'2.0.1'!C70)","v":"Did your agency receive funding from federal or private granting organizations through grant awards or contracts during the year?"},{"$f":"IF('2.0.1'!G70=\"\",\"\",'2.0.1'!G70)","v":"Yes"}]
{"$rows_left_out":441}
{"sheet":"37. (Cont)","index":7,"n_rows":16,"n_cols":27,"rows_kept":16,"cut":false,"hidden":true,"merged":[]}
[]
["37. (Cont)"]
[null,null,null,null,null,null,null,null,"Additional Loan 1",null,"Additional Loan 2",null,"Additional Loan 3",null,"Additional Loan 4",null,"Additional Loan 5",null,"Additional Loan 6",null,"Additional Loan 7",null,"Additional Loan 8",null,"Additional Loan 9",null,"Additional Loan 10"]
[null,"Action:  Provide the following information"]
[null,null,"Is your agency the lendor or borrower?"]
[null,null,"Name of counter-party (other agency involved)?"]
[null,null,"Original amount of the loan"]
[null,null,"Date of the original loan"]
[null,null,"Additional advances made"]
[null,null,"Dates of additional advances"]
[null,null,"Balance as of June 30"]
[null,null,"Number of Payments required"]
[null,null,"Frequency of payments required (selections in drop-down)"]
[null,null,"Copies of signed agreements (for new loans only)."]
[]
[null,"Note:  Space for ten additional loans have been provided.  If you need additional space, please contact the CG's Office."]

{"sheet":"42. (Cont)","index":8,"n_rows":17,"n_cols":25,"rows_kept":17,"cut":false,"hidden":true,"merged":[]}
[]
["42. (Cont)"]
[]
[null,"a.",null,null,null,null,"Escrow Account 1",null,"Escrow Account 2",null,"Escrow Account 3",null,"Escrow Account 4",null,"Escrow Account 5",null,"Escrow Account 6",null,"Escrow Account 7",null,"Escrow Account 8",null,"Escrow Account 9",null,"Escrow Account 10"]
[]
[null,null,"Lease ID #"]
[null,null,"Amount held in escrow"]
[]
[]
[null,null,null,null,null,null,"Escrow Account 1",null,"Escrow Account 2",null,"Escrow Account 3",null,"Escrow Account 4",null,"Escrow Account 5",null,"Escrow Account 6",null,"Escrow Account 7",null,"Escrow Account 8",null,"Escrow Account 9",null,"Escrow Account 10"]
[]
[null,"b.","Lease ID #(s)"]
[null,null,"Date the escrow account was closed"]
[]
[]
[]
[null,null,"Note:  Space for ten additional open and closed escrow accounts have been provided.  If you need additional space, please contact the CG's Office."]

{"sheet":"44. (Cont)","index":9,"n_rows":11,"n_cols":45,"rows_kept":11,"cut":false,"hidden":true,"merged":[[2,30,2,32],[2,34,2,36],[2,38,2,40],[2,42,2,44],[2,6,2,8],[2,10,2,12],[2,14,2,16],[2,18,2,20],[2,22,2,24],[2,26,2,28]]}
[]
["44. (Cont)"]
[null,null,null,null,null,null,"Additional Agreement 1",null,null,null,"Additional Agreement 2",null,null,null,"Additional Agreement 3",null,null,null,"Additional Agreement 4",null,null,null,"Additional Agreement 5",null,null,null,"Additional Agreement 6",null,null,null,"Additional Agreement 7",null,null,null,"Additional Agreement 8",null,null,null,"Additional Agreement 9",null,null,null,"Additional Agreement 10"]
[null,"Action:  Provide the following information "]
[null,null,"Principle amount"]
[null,null,null,null,null,null,"General Ledger Account",null,"Amount",null,"General Ledger Account",null,"Amount",null,"General Ledger Account",null,"Amount",null,"General Ledger Account",null,"Amount",null,"General Ledger Account",null,"Amount",null,"General Ledger Account",null,"Amount",null,"General Ledger Account",null,"Amount",null,"General Ledger Account",null,"Amount",null,"General Ledger Account",null,"Amount",null,"General Ledger Account",null,"Amount"]
[null,null,"Interest amount"]
[null,null,null,null,null,null,"General Ledger Account",null,"Amount",null,"General Ledger Account",null,"Amount",null,"General Ledger Account",null,"Amount",null,"General Ledger Account",null,"Amount",null,"General Ledger Account",null,"Amount",null,"General Ledger Account",null,"Amount",null,"General Ledger Account",null,"Amount",null,"General Ledger Account",null,"Amount",null,"General Ledger Account",null,"Amount",null,"General Ledger Account",null,"Amount"]
[]
[]
[null,"Note:  Space for ten additional agreements have been provided.  If you need additional space, please contact the CG's Office."]