{"text_format":"1","workbook":"xlsx","n_sheets":8,"sheets":["Instructions","Signature 1","3.18.1 ","3.18.1","3.18.2 ","3.18.2","3.18.3","Summary"],"not_rendered":{"charts":0,"images":0,"macros":1,"external_links":0,"defined_names":18,"comments":0,"pivot_tables":0},"unopened":[],"bounds":{"document_bytes":16777216,"sheet_cells":100000,"rows_first":2000,"rows_last":500,"rows_between":2000,"halvings":0,"cell_chars":16384,"cell_head_chars":4096},"cells_cut":0,"cells_raw":0,"read":"whole","date_system":"1900"}

{"sheet":"Instructions","index":0,"n_rows":78,"n_cols":7,"rows_kept":78,"cut":false,"hidden":false,"merged":[]}
["STATE OF SOUTH CAROLINA"]
["YEAR-END REPORTING PROCEDURES MANUAL"]
["SECTION 3.18, INTERFUND PAYABLES AND RECEIVABLES REPORTING PACKAGE"]
[]
[]
[null,"PURPOSE and OBJECTIVES"]
[null,"To gather information needed for the recognition and reporting of amounts owed from one agency to another "]
[null,"or from one accounting fund within the agency to another required by GAAP.  The amounts to be reported"]
[null,"should not include the Loan payments, Medicaid payments, distributions to grantees, or amounts owed "]
[null,"to vendors."]
[]
[]
[null,"INSTRUCTIONS FOR COMPLETION OF FORMS:"]
[null,"Interfund Payables Summary Form",null,null,null,null,"3.18.1"]
[null,"Use this form to indicate the accuracy of the SCEIS report and provide omissions of interfund payables.  "]
[null,"● Complete the information indicated by the descriptions on the form."]
[null,"○   Features included in the form:"]
[null,"►    The year for reporting is provided as a drop-down menu selection."]
[null,"►    A validation check has been added for appropriate characters for the Fund Number."]
[null,"►    A validation check has been added for appropriate characters for the Agency Business Area."]
[null,"►    Drop-down menus are provided for question responses."]
[null,"►    Specific instructions are provided based on the responses to the questions."]
[null,"►    Provide a brief description of transactions reported.  Include the internal fund if transaction "]
[null,"within your agency."]
[null,"● Procedures to prepare the information for reporting"]
[null,"○   Gather information during processing of the transactions to identify payables processed for other "]
[null,"state agencies or for payment to other funds within the reporting agency.  See Section 3.12 "]
[null,"for further guidance."]
[null,"○   Compare the amounts in the working papers and supporting schedules to the amounts reported "]
[null,"in the SCEIS Report provided by the Comptroller General's Office."]
[null,"○   For transactions included on the report in error, mark the report, include an explanation, and "]
[null,"provide to the Comptroller General's Office with the form.  Retain a copy for agency records."]
[null,"○   For transactions omitted from the report, provide the information requested on Form 3.18.1."]
[null,"○   Include any known interfund payables that have not yet been processed in SCEIS."]
[null,"Upon completion of the information requested:"]
[null,"● The individual completing the form should review the form for accuracy and completeness prior to signing"]
[null,"the summary signature sheet as an assertion of the accuracy and completeness of the information reported.  "]
[null,"● The Finance Director or Executive Director should review and approve the form indicating agreement "]
[null,"with the information’s accuracy and completeness before sending it to the Comptroller General's Office."]
[null,"● Both the preparer and approver certify that the information provided on this reporting package"]
{"$rows_left_out":39}
{"sheet":"Signature 1","index":1,"n_rows":136,"n_cols":6,"rows_kept":136,"cut":false,"hidden":false,"merged":[[135,1,135,5],[124,1,124,5],[126,1,126,5],[128,1,128,5],[130,1,130,5],[132,1,132,5]]}
[null,null,"3.18 Interfund Paybles and Receivables Packet"]
[]
[]
[null,null,"CAFR Reporting Period:",null,2019]
[null,null,"Agency Number:",null,null," "]
[null,null,"Agency Name",null,{"$f":"IF(ISERROR(VLOOKUP(AgencyCode,C32:D109,2,FALSE))=TRUE,\"\",VLOOKUP(AgencyCode,C32:D109,2,FALSE))","v":""}]
[]
[]
[]
[]
[]
[null,null,"Preparer","Date:",null," "]
[null,null,null,"Name:",null," "]
[null,null,null,"Title:",null," "]
[null,null,null,"e-mail:",null," "]
[null,null,null,"Phone Number:",null," "]
[null,null,null,"Signature:",null," "]
[]
[null,null,"Reviewer","Date:",null," "]
[null,null,null,"Name:",null," "]
[null,null,null,"Title:",null," "]
[null,null,null,"e-mail:",null," "]
[null,null,null,"Phone Number:",null," "]
[null,null,null,"Signature:",null," "]
[]
[null,null,"Signatures are an assertion of the accuracy and completeness of the information reported.  "]
[]
[]
[null,null,"The following information must be reviewed and updated as necessary anually:"]
[]
[null,null,"AGCY  CODE","AGENCY NAME","Year"]
[null,null,"A010","LEGISLATIVE DEPARTMENT - THE SENATE"]
[null,null,"A050","LEGISLATIVE DEPARTMENT - HOUSE OF REPRESENTATIVES"]
[null,null,"A150","LEGISLATIVE DEPARTMENT - CODIFICATION OF LAWS & LEGISLATIVE COUNCIL"]
[null,null,"A170","LEGISLATIVE DEPARTMENT - LEGISLATIVE SERVICES AGENCY"]
[null,null,"A200","LEGISLATIVE DEPARTMENT - LEGISLATIVE AUDIT COUNCIL"]
[null,null,"A850","EDUCATION OVERSIGHT COMMITTEE"]
[null,null,"B040","JUDICIAL DEPARTMENT"]
[null,null,"C050","ADMINISTRATIVE LAW JUDGES"]
[null,null,"D050","GOVERNOR'S OFFICE--EXECUTIVE CONTROL OF STATE"]
{"$rows_left_out":97}
{"sheet":"3.18.1 ","index":2,"n_rows":172,"n_cols":8,"rows_kept":172,"cut":false,"hidden":false,"merged":[]}
["STATE OF SOUTH CAROLINA"]
["INTERFUND PAYABLES SUMMARY FORM"]
[null,null,null,null,"At June 30, "]
[]
[]
["Agency:",null,null,null,null,null,"SET MACROS TO ENABLE "]
["Name:",null,{"$f":"IF(AgencyCode=\"\",\"\",VLOOKUP(AgencyCode,A56:B172,2))","v":""}]
[]
["Preparer (Type Name):"]
[]
["Reviewer (Type Name):"]
[]
[]
["1.   Does the report provided by the Comptroller General's Office accurately report all "]
["of the interfund payables identified in processing by agency personnel?"]
[null,{"$f":"IF(H15=\"\",\"\",IF(H15=\"Yes\",\"Skip Question 2 and Fill Out Detail Below Question 2.\",\"Answer Question 2.\"))","v":""}]
[]
["2.  Did the report include errors or were there omissions?"]
[]
[null,{"$f":"IF(H18=\"\",\"\",IF(OR(H18=\"Errors\",H18=\"Errors and Omissions\"),\"Identify the errors on the report and explain why they are errors.  Return the report with this form.\",\"\"))","v":""}]
["3.  Are any of the payables individually over $100,000?  If yes please fill out the schedule below."]
[null,{"$f":"IF(H18=\"\",\"\",IF(OR(H18=\"Omissions\",H18=\"Errors and Omissions\"),\"Provide the Omissions in the space below, if additional space is needed, attach a sheet.\",\"\"))","v":""}]
[null,"Only individual interfund payables over $100,000 each should be reported below"]
["Fund","Related",null,"Agency","Fund","Related","Voucher Number or"]
["Owing the","Account for",null,"Owed the","Owed the","Account for","Invoice/Payment","Dollar Amount"]
["Amount","Expenditure","Description of transaction","Amount","Amount","Revenue","Document Number","Interfund Payable"]
[]
[]
[]
[]
[]
[]
[]
[]
[]
[]
[]
[]
[]
[]
{"$rows_left_out":133}
{"sheet":"3.18.1","index":3,"n_rows":168,"n_cols":18,"rows_kept":168,"cut":false,"hidden":true,"merged":[]}
["STATE OF SOUTH CAROLINA"]
["INTERFUND PAYABLES SUMMARY FORM"]
[null,null,null,null,null,null,null,null,null,null,"At June 30, "]
[]
[]
[null,"Agency:"]
[null,"Name:",null,null,null,{"$f":"IF(AgencyCode=\"\",\"\",VLOOKUP(AgencyCode,B54:C168,2))","v":""}]
[]
[]
[null,"1.   Does the report provided by the Comptroller General's Office accurately report all "]
[null,"of the interfund payables identified in processing by agency personnel?"]
[]
[null,null,{"$f":"IF(R11=\"\",\"\",IF(R11=\"Yes\",\"STOP. Sign the form and submit it.\",\"Answer Question 2.\"))","v":""}]
[]
[null,"2.  Did the report include errors or were there omissions?"]
[]
[null,null,{"$f":"IF(R15=\"\",\"\",IF(OR(R15=\"Errors\",R15=\"Errors and Omissions\"),\"Identify the errors on the report and explain why they are errors.  Return the report with this form.\",\"\"))","v":""}]
[null,null,{"$f":"IF(R15=\"\",\"\",IF(OR(R15=\"Omissions\",R15=\"Errors and Omissions\"),\"Provide the Omissions in the space below, if additional space is needed, attach a sheet.\",\"\"))","v":""}]
[]
[null,"Fund",null,"Related",null,null,null,"Agency",null,"Fund",null,"Related",null,null,"Voucher Number or"]
[null,"Owing the",null,"Account for",null,null,null,"Owed the",null,"Owed the",null,"Account for",null,null,"Invoice/Payment",null,null,"Dollar Amount"]
[null,"Amount",null,"Expenditure",null,"Description of transaction",null,"Amount",null,"Amount",null,"Revenue",null,null,"Document Number",null,null,"Interfund Payable"]
[]
[null,null,null,null,null,null,null,null,null,null,null,null,null,null,null,null,"$"]
[]
[null,null,null,null,null,null,null,null,null,null,null,null,null,null,null,null,"$"]
[]
[null,null,null,null,null,null,null,null,null,null,null,null,null,null,null,null,"$"]
[]
[null,null,null,null,null,null,null,null,null,null,null,null,null,null,null,null,"$"]
[]
[null,null,null,null,null,null,null,null,null,null,null,null,null,null,null,null,"$"]
[]
[null,null,null,null,null,null,null,null,null,null,null,null,null,null,null,null,"$"]
[]
[null,null,null,null,null,null,null,null,null,null,null,null,null,null,null,null,"$"]
[]
[null,null,null,null,null,null,null,null,null,null,null,null,null,null,null,null,"$"]
[]
[null,null,null,null,null,null,null,null,null,null,null,null,null,null,null,null,"$"]
{"$rows_left_out":129}
{"sheet":"3.18.2 ","index":4,"n_rows":163,"n_cols":8,"rows_kept":163,"cut":false,"hidden":false,"merged":[]}
["STATE OF SOUTH CAROLINA"]
["INTERFUND RECEIVABLES SUMMARY FORM"]
[null,null,null,null,"At June 30, "]
[]
[]
["Agency:",null,null,null,null,null,"SET MACROS TO ENABLE "]
["Name:",null,{"$f":"IF(AgencyCode=\"\",\"\",VLOOKUP(AgencyCode,A47:B163,2))","v":""}]
[]
["Preparer (Type Name):"]
[]
["Reviewer (Type Name):"]
[]
[]
[null,"Only individual interfund receivables over $100,000 each should be reported below"]
["Fund","Related",null,"Agency","Fund","Related","Voucher Number or"]
["Owed the","Account for",null,"Owing the","Owing the","Account for","Invoice/Payment","Dollar Amount"]
["Amount","Revenue","Description of transaction","Amount","Amount","Expenditure","Document Number","Interfund Payable"]
[]
[]
[]
[]
[]
[]
[]
[]
[]
[]
[]
[]
[]
[]
[]
[]
[]
[]
[]
[]
[]
[]
[]
{"$rows_left_out":124}
{"sheet":"3.18.2","index":5,"n_rows":168,"n_cols":18,"rows_kept":168,"cut":false,"hidden":true,"merged":[]}
["STATE OF SOUTH CAROLINA"]
["INTERFUND RECEIVABLES SUMMARY FORM"]
[null,null,null,null,null,null,null,null,null,null,"At June 30, "]
[]
[]
[null,"Agency:"]
[null,"Name:",null,null,null,{"$f":"IF(AgencyCode=\"\",\"\",VLOOKUP(AgencyCode,B54:C168,2))","v":""}]
[]
[]
[null,"1.   Does the report provided by the Comptroller General's Office accurately report all "]
[null,"of the interfund receivables identified in processing by agency personnel?"]
[]
[null,null,{"$f":"IF(R11=\"\",\"\",IF(R11=\"Yes\",\"STOP. Sign the form and submit it.\",\"Answer Question 2.\"))","v":""}]
[]
[null,"2.  Did the report include errors or were there omissions?"]
[]
[null,null,{"$f":"IF(R15=\"\",\"\",IF(OR(R15=\"Errors\",R15=\"Errors and Omissions\"),\"Identify the errors on the report and explain why they are errors.  Return the report with this form.\",\"\"))","v":""}]
[null,null,{"$f":"IF(R15=\"\",\"\",IF(OR(R15=\"Omissions\",R15=\"Errors and Omissions\"),\"Provide the Omissions in the space below, if additional space is needed, attach a sheet.\",\"\"))","v":""}]
[]
[null,"Fund",null,"Related",null,null,null,"Agency",null,"Fund",null,"Related",null,null,"Voucher Number or"]
[null,"Owed the",null,"Account for",null,null,null,"Owing the",null,"Owing the",null,"Account for",null,null,"Invoice/Payment",null,null,"Dollar Amount"]
[null,"Amount",null,"Revenue",null,"Description of transaction",null,"Amount",null,"Amount",null,"Expenditure",null,null,"Document Number",null,null,"Interfund Payable"]
[]
[null,null,null,null,null,null,null,null,null,null,null,null,null,null,null,null,"$"]
[]
[null,null,null,null,null,null,null,null,null,null,null,null,null,null,null,null,"$"]
[]
[null,null,null,null,null,null,null,null,null,null,null,null,null,null,null,null,"$"]
[]
[null,null,null,null,null,null,null,null,null,null,null,null,null,null,null,null,"$"]
[]
[null,null,null,null,null,null,null,null,null,null,null,null,null,null,null,null,"$"]
[]
[null,null,null,null,null,null,null,null,null,null,null,null,null,null,null,null,"$"]
[]
[null,null,null,null,null,null,null,null,null,null,null,null,null,null,null,null,"$"]
[]
[null,null,null,null,null,null,null,null,null,null,null,null,null,null,null,null,"$"]
[]
[null,null,null,null,null,null,null,null,null,null,null,null,null,null,null,null,"$"]
{"$rows_left_out":129}
{"sheet":"3.18.3","index":6,"n_rows":51,"n_cols":7,"rows_kept":51,"cut":false,"hidden":false,"merged":[]}
["STATE OF SOUTH CAROLINA"]
["INTERFUND PAYABLES AND RECEIVABES REPORTING PACKAGE"]
["REVIEWER CHECKLIST"]
[null,null,null,null,null,"               FISCAL YEAR",{"$f":"'Signature 1'!Year","v":2019}]
[]
["REVIEW STEP"]
[{"$f":"COUNT(A$6:A6)+1","v":1},"Is the reviewer of the forms someone other than the person who prepared it?"]
[]
[{"$f":"COUNT(A$6:A8)+1","v":2},"Is contact information (title, email, and telephone numbers) for the preparer and "]
[null,"reviewer acccurately provided on the signature summary sheet?"]
[]
[{"$f":"COUNT(A$6:A11)+1","v":3},"Can all amounts reported on the forms be traced to official agency "]
[null,"accounting records?"]
[]
["Interfund Payables Summary Form (3.18.1)"]
[{"$f":"COUNT(A$6:A15)+1","v":4},"Were clear instructions provided to processors for payments from the agency to"]
[null,"identify and track any transactions with other state agencies occurring prior to "]
[null,"June 30 for proper reporting of an accrual?"]
[]
[{"$f":"COUNT(A$6:A19)+1","v":5},"Has an appropriate period subsequent to June 30 been reviewed to identify "]
[null,"amounts owed to other state agencies or to other funds within your agency? "]
[]
[{"$f":"COUNT(A$6:A22)+1","v":6},"Does the form include the agency or fund within your agency to which amounts "]
[null,"are owed? "]
[]
[{"$f":"COUNT(A$6:A25)+1","v":7},"Does the form include the agency voucher number, and the dollar amount "]
[null,"of the interfund payable?"]
[]
[{"$f":"COUNT(A$6:A26)+1","v":8},"Are document numbers or copies of the disbursement vouchers and IDT’s "]
[null,"included with form?"]
[]
[{"$f":"COUNT(A$6:A31)+1","v":9},"Does the form include any known interfund payables "]
[null,"that have not been paid as of the close of Period 02 of the fiscal year after "]
[null,"the reporting year?"]
[]
[{"$f":"COUNT(A$6:A35)+1","v":10},"Has the activity been compared with the prior year, documenting causes "]
[null,"for any large fluctuations that can be easily obtained and explained to "]
[null,"individuals not familiar with the daily operations of the agency?"]
[]
["Interfund Receivables Summary Form (3.18.2)"]
{"$rows_left_out":12}
{"sheet":"Summary","index":7,"n_rows":1191,"n_cols":7,"rows_kept":1191,"cut":false,"hidden":true,"merged":[]}
["Worksheet","Agnecy Code","Agency Name","Year","QUESTION","Cell","Answers"]
["3.18.1",{"$f":"IF(AgencyCode=\"\",\"\",AgencyCode)","v":""},{"$f":"IF(AgencyName=\"\",\"\",AgencyName)","v":""},{"$f":"IF(Year=\"\",\"\",Year)","v":""},"Prepared By","C8:D8",{"$f":"IF('3.18.1 '!#REF!=\"\",\"\",'3.18.1 '!#REF!)","v":{"$error":"#REF!"}}]
["3.18.1","","","","Preparer Title","F10:O10",{"$f":"IF('3.18.1 '!#REF!=\"\",\"\",'3.18.1 '!#REF!)","v":{"$error":"#REF!"}}]
["3.18.1","","","","Preparer eMail","Q8:T8",{"$f":"IF('3.18.1 '!#REF!=\"\",\"\",'3.18.1 '!#REF!)","v":{"$error":"#REF!"}}]
["3.18.1","","","","Preparer Phone No","R10:T10",{"$f":"IF('3.18.1 '!#REF!=\"\",\"\",'3.18.1 '!#REF!)","v":{"$error":"#REF!"}}]
["3.18.1","","","","Approval Date","C12:D12",{"$f":"IF('3.18.1 '!#REF!=\"\",\"\",'3.18.1 '!#REF!)","v":{"$error":"#REF!"}}]
["3.18.1","","","","Approver Title","F14:O14",{"$f":"IF('3.18.1 '!#REF!=\"\",\"\",'3.18.1 '!#REF!)","v":{"$error":"#REF!"}}]
["3.18.1","","","","Approver eMail","Q12:T12",{"$f":"IF('3.18.1 '!#REF!=\"\",\"\",'3.18.1 '!#REF!)","v":{"$error":"#REF!"}}]
["3.18.1","","","","Approver Phone No","R14:T14",{"$f":"IF('3.18.1 '!#REF!=\"\",\"\",'3.18.1 '!#REF!)","v":{"$error":"#REF!"}}]
["3.18.1","","","",1,"S18",{"$f":"IF('3.18.1 '!H15=\"\",\"\",'3.18.1 '!H15)","v":""}]
["3.18.1","","","","1. Determination","C20",{"$f":"IF('3.18.1 '!B16=\"\",\"\",'3.18.1 '!B16)","v":""}]
["3.18.1","","","",2,"O22:S22",{"$f":"IF('3.18.1 '!H18=\"\",\"\",'3.18.1 '!H18)","v":""}]
["3.18.1","","","","2. Determination #1","C24",{"$f":"IF('3.18.1 '!B20=\"\",\"\",'3.18.1 '!B20)","v":""}]
["3.18.1","","","","2. Determination #2","C25",{"$f":"IF('3.18.1 '!B22=\"\",\"\",'3.18.1 '!B22)","v":""}]
["3.18.1","","","","Fund owing amount - 1","B33",{"$f":"IF('3.18.1 '!A27=\"\",\"\",'3.18.1 '!A27)","v":""}]
["3.18.1","","","","Fund owing amount - 2","B35",{"$f":"IF('3.18.1 '!A41=\"\",\"\",'3.18.1 '!A41)","v":""}]
["3.18.1","","","","Fund owing amount - 3","B37",{"$f":"IF('3.18.1 '!A42=\"\",\"\",'3.18.1 '!A42)","v":""}]
["3.18.1","","","","Fund owing amount - 4","B39",{"$f":"IF('3.18.1 '!A43=\"\",\"\",'3.18.1 '!A43)","v":""}]
["3.18.1","","","","Fund owing amount - 5","B41",{"$f":"IF('3.18.1 '!A44=\"\",\"\",'3.18.1 '!A44)","v":""}]
["3.18.1","","","","Fund owing amount - 6","B43",{"$f":"IF('3.18.1 '!A45=\"\",\"\",'3.18.1 '!A45)","v":""}]
["3.18.1","","","","Fund owing amount - 7","B45",{"$f":"IF('3.18.1 '!A46=\"\",\"\",'3.18.1 '!A46)","v":""}]
["3.18.1","","","","Fund owing amount - 8","B47",{"$f":"IF('3.18.1 '!A47=\"\",\"\",'3.18.1 '!A47)","v":""}]
["3.18.1","","","","Fund owing amount - 9","B49",{"$f":"IF('3.18.1 '!A48=\"\",\"\",'3.18.1 '!A48)","v":""}]
["3.18.1","","","","Fund owing amount - 10","B51",{"$f":"IF('3.18.1 '!A49=\"\",\"\",'3.18.1 '!A49)","v":""}]
["3.18.1","","","","Fund owing amount - 11","B53",{"$f":"IF('3.18.1 '!#REF!=\"\",\"\",'3.18.1 '!#REF!)","v":{"$error":"#REF!"}}]
["3.18.1","","","","Fund owing amount - 12","B55",{"$f":"IF('3.18.1 '!#REF!=\"\",\"\",'3.18.1 '!#REF!)","v":{"$error":"#REF!"}}]
["3.18.1","","","","Description - 1","D33:I33",{"$f":"IF('3.18.1 '!C27=\"\",\"\",'3.18.1 '!C27)","v":""}]
["3.18.1","","","","Description - 2","D35:I35",{"$f":"IF('3.18.1 '!C41=\"\",\"\",'3.18.1 '!C41)","v":""}]
["3.18.1","","","","Description - 3","D37:I37",{"$f":"IF('3.18.1 '!C42=\"\",\"\",'3.18.1 '!C42)","v":""}]
["3.18.1","","","","Description - 4","D39:I39",{"$f":"IF('3.18.1 '!C43=\"\",\"\",'3.18.1 '!C43)","v":""}]
["3.18.1","","","","Description - 5","D41:I41",{"$f":"IF('3.18.1 '!C44=\"\",\"\",'3.18.1 '!C44)","v":""}]
["3.18.1","","","","Description - 6","D43:I43",{"$f":"IF('3.18.1 '!C45=\"\",\"\",'3.18.1 '!C45)","v":""}]
["3.18.1","","","","Description - 7","D45:I45",{"$f":"IF('3.18.1 '!C46=\"\",\"\",'3.18.1 '!C46)","v":""}]
["3.18.1",{"$f":"IF(AgencyCode=\"\",\"\",AgencyCode)","v":""},{"$f":"IF(AgencyName=\"\",\"\",AgencyName)","v":""},{"$f":"IF(Year=\"\",\"\",Year)","v":""},"Description - 8","D47:I47",{"$f":"IF('3.18.1 '!C47=\"\",\"\",'3.18.1 '!C47)","v":""}]
["3.18.1","","","","Description - 9","D49:I49",{"$f":"IF('3.18.1 '!C48=\"\",\"\",'3.18.1 '!C48)","v":""}]
["3.18.1","","","","Description - 10","D51:I51",{"$f":"IF('3.18.1 '!C49=\"\",\"\",'3.18.1 '!C49)","v":""}]
["3.18.1","","","","Description - 11","D53:I53",{"$f":"IF('3.18.1 '!#REF!=\"\",\"\",'3.18.1 '!#REF!)","v":{"$error":"#REF!"}}]
["3.18.1","","","","Description - 12","D55:I55",{"$f":"IF('3.18.1 '!#REF!=\"\",\"\",'3.18.1 '!#REF!)","v":{"$error":"#REF!"}}]
["3.18.1","","","","Agency or Fund owed Amount - 1","K33",{"$f":"IF('3.18.1 '!F27=\"\",\"\",'3.18.1 '!F27)","v":""}]
["3.18.1","","","","Agency or Fund owed Amount - 2","K35",{"$f":"IF('3.18.1 '!F41=\"\",\"\",'3.18.1 '!F41)","v":""}]
{"$rows_left_out":1151}