{"text_format":"1","workbook":"xlsx","n_sheets":16,"sheets":["Instructions","Signature 1","3.15.1","3.15.1 (Cont 1)","3.15.1 (Cont 2)","3.15.1 (Cont 3)","3.15.1 (Cont 4)","3.15.1 (Cont 5)","3.15.2","3.15.2 (Cont 1)","3.15.2 (Cont 2)","3.15.2 (Cont 3)","3.15.2 (Cont 4)","3.15.2 (Cont 5)","3.15.3","Summary"],"not_rendered":{"charts":0,"images":0,"macros":1,"external_links":0,"defined_names":11,"comments":0,"pivot_tables":0},"unopened":[],"bounds":{"document_bytes":16777216,"sheet_cells":100000,"rows_first":2000,"rows_last":500,"rows_between":2000,"halvings":0,"cell_chars":16384,"cell_head_chars":4096},"cells_cut":0,"cells_raw":0,"read":"whole","date_system":"1900"}

{"sheet":"Instructions","index":0,"n_rows":82,"n_cols":10,"rows_kept":82,"cut":false,"hidden":false,"merged":[]}
["STATE OF SOUTH CAROLINA"]
["YEAR-END REPORTING PROCEDURES MANUAL"]
["SECTION 3.15, CLAIMS REPORTING PACKAGE"]
[]
[]
[null,"PURPOSE and OBJECTIVE:"]
[null,"The State is required by GAAP to report liabilities for the estimated future costs of all events giving rise to "]
[null,"claims that occurred on or before June 30 if it is probable that an asset has been impaired or a liability has "]
[null,"been incurred as of that date and the loss amount can be reasonably estimated.  Disclosure of events during "]
[null,"the year and subsequent to year-end that may materially affect future claims costs are also required. "]
[]
[null,"Please refer to the Reporting Policies and Procedures Manual for definitions of terms used in the forms, "]
[null,"conceptual understanding of the reporting, related GAAP, and State reporting policies."]
[]
[null,"INSTRUCTIONS FOR COMPLETION OF FORMS:"]
[null,"Claims Summary Form",null,null,null,null,null,null,null,"3.15.1"]
[null,"This form provides information regarding the liabilities to be reported as of year-end and its financial"]
[null,"statement classification."]
[null,"● Complete a separate form for each claim-paying program or type of self-insured risk.  Create copies of the"]
[null,"form as needed for complete reporting."]
[null,"● Enter the information required as indicated with field descriptions."]
[null,"○   Features within the form to assist in completion:"]
[null,"►    The reporting year is provided as a drop-down menu selection."]
[null,"►    A validation check is provided for keying errors in Fund Number."]
[null,"►    An edit check is included to restrict the dollar amount to the requested range."]
[null,"►    An instruction box is included on the dollar amounts for accurate reporting."]
[null,"►    The total is a calculated field.  Please confirm the accuracy of the calculation."]
[null,"Upon completion of the information requested:"]
[null,"● The individual completing the form should review the form for accuracy and completeness prior to signing"]
[null,"the summary signature sheet as an assertion of the accuracy and completeness of the information reported.  "]
{"$rows_left_out":53}
{"sheet":"Signature 1","index":1,"n_rows":135,"n_cols":6,"rows_kept":135,"cut":false,"hidden":false,"merged":[[134,1,134,5],[123,1,123,5],[125,1,125,5],[127,1,127,5],[129,1,129,5],[131,1,131,5]]}
[null,null,"3.15 Claims Packet"]
[]
[]
[null,null,"CAFR Reporting Period:",null,2019]
[null,null,"Agency Number:",null,null," "]
[null,null,"Agency Name",null,{"$f":"IF(ISERROR(VLOOKUP(AgencyCode,C32:D108,2,FALSE))=TRUE,\"\",VLOOKUP(AgencyCode,C32:D108,2,FALSE))","v":""}]
[]
[]
[]
[]
[]
[null,null,"Preparer","Date:",null," "]
[null,null,null,"Name:",null," "]
[null,null,null,"Title:",null," "]
[null,null,null,"e-mail:",null," "]
[null,null,null,"Phone Number:",null," "]
[null,null,null,"Signature:",null," "]
[]
[null,null,"Reviewer","Date:",null," "]
[null,null,null,"Name:",null," "]
[null,null,null,"Title:",null," "]
[null,null,null,"e-mail:",null," "]
[null,null,null,"Phone Number:",null," "]
[null,null,null,"Signature:",null," "]
[]
[null,null,"Signatures are an assertion of the accuracy and completeness of the information reported.  "]
[]
[]
[null,null,"The following information must be reviewed and updated as necessary anually:"]
[]
{"$rows_left_out":106}
{"sheet":"3.15.1","index":2,"n_rows":161,"n_cols":10,"rows_kept":161,"cut":false,"hidden":false,"merged":[[31,0,31,7],[21,0,21,1],[24,0,24,7],[27,0,27,7],[5,3,5,8],[20,2,20,7],[23,0,23,7],[13,5,13,9],[28,0,28,7],[8,3,8,8],[10,3,10,8]]}
["STATE OF SOUTH CAROLINA"]
["CLAIMS SUMMARY FORM"]
[null,null,null,null,"At June 30,"]
[]
[]
["Agency:",null,null,{"$f":"IF(AgencyCode=\"\",\"\",VLOOKUP(AgencyCode,A45:B161,2))","v":""}]
[null,"Bus. Area",null,"Name"]
[]
["Preparer (Type Name):"]
[]
["Reviewer (Type Name):"]
[]
[]
["Name of Claim-Paying Program/Type of Self-Insured Risk:"]
[]
[]
["Fund:"]
[]
[]
[]
[null,null,"Description",null,null,null,null,null,"Dollar Amount"]
[]
[]
["Liability for Claims that the agency paid or plans to process for payment in the "]
["     extended 12th period of the current fiscal year (marked as \"Prior Year Payable\").",null,null,null,null,null,null,null,"$"]
[]
[]
["Liability for Claims that the agency plans to pay during period 1 - 12 of"]
["     the next fiscal year.",null,null,null,null,null,null,null,"$"]
[]
{"$rows_left_out":132}
{"sheet":"3.15.1 (Cont 1)","index":3,"n_rows":35,"n_cols":10,"rows_kept":35,"cut":false,"hidden":true,"merged":[[20,0,20,7],[23,0,23,7],[24,0,24,7],[27,0,27,7],[5,3,5,8],[9,5,9,9],[16,2,16,7],[17,0,17,1],[19,0,19,7]]}
["STATE OF SOUTH CAROLINA"]
["CLAIMS SUMMARY FORM"]
[null,null,null,null,"At June 30,",{"$f":"IF(Year=\"\",\"\",Year)","v":""}]
[]
[]
["Agency:",{"$f":"IF(AgencyCode=\"\",\"\",AgencyCode)","v":""},null,{"$f":"IF(AgencyName=\"\",\"\",AgencyName)","v":""}]
[null,"Bus. Area",null,"Name"]
[]
[]
["Name of Claim-Paying Program/Type of Self-Insured Risk:"]
[]
[]
["Fund:"]
[]
[]
[]
[null,null,"Description",null,null,null,null,null,"Dollar Amount"]
[]
[]
["Liability for Claims that the agency paid or plans to process for payment in the "]
["     extended 12th period of the current fiscal year (marked as \"Prior Year Payable\").",null,null,null,null,null,null,null,"$"]
[]
[]
["Liability for Claims that the agency plans to pay during period 1 - 12 of"]
["     the next fiscal year.",null,null,null,null,null,null,null,"$"]
[]
[]
["Liability for Claims that the agency plans to pay after June 30 of next fiscal year",null,null,null,null,null,null,null,"$"]
[]
[]
{"$rows_left_out":6}
{"sheet":"3.15.1 (Cont 2)","index":4,"n_rows":34,"n_cols":10,"rows_kept":34,"cut":false,"hidden":true,"merged":[[20,0,20,7],[23,0,23,7],[24,0,24,7],[27,0,27,7],[5,3,5,8],[9,5,9,9],[16,2,16,7],[17,0,17,1],[19,0,19,7]]}
["STATE OF SOUTH CAROLINA"]
["CLAIMS SUMMARY FORM"]
[null,null,null,null,"At June 30,",{"$f":"IF(Year=\"\",\"\",Year)","v":""}]
[]
[]
["Agency:",{"$f":"IF(AgencyCode=\"\",\"\",AgencyCode)","v":""},null,{"$f":"IF(AgencyName=\"\",\"\",AgencyName)","v":""}]
[null,"Bus. Area",null,"Name"]
[]
[]
["Name of Claim-Paying Program/Type of Self-Insured Risk:"]
[]
[]
["Fund:"]
[]
[]
[]
[null,null,"Description",null,null,null,null,null,"Dollar Amount"]
[]
[]
["Liability for Claims that the agency paid or plans to process for payment in the "]
["     extended 12th period of the current fiscal year (marked as \"Prior Year Payable\").",null,null,null,null,null,null,null,"$"]
[]
[]
["Liability for Claims that the agency plans to pay during period 1 - 12 of"]
["     the next fiscal year.",null,null,null,null,null,null,null,"$"]
[]
[]
["Liability for Claims that the agency plans to pay after June 30 of next fiscal year",null,null,null,null,null,null,null,"$"]
[]
[]
{"$rows_left_out":5}
{"sheet":"3.15.1 (Cont 3)","index":5,"n_rows":35,"n_cols":10,"rows_kept":35,"cut":false,"hidden":true,"merged":[[20,0,20,7],[23,0,23,7],[24,0,24,7],[27,0,27,7],[5,3,5,8],[9,5,9,9],[16,2,16,7],[17,0,17,1],[19,0,19,7]]}
["STATE OF SOUTH CAROLINA"]
["CLAIMS SUMMARY FORM"]
[null,null,null,null,"At June 30,",{"$f":"IF(Year=\"\",\"\",Year)","v":""}]
[]
[]
["Agency:",{"$f":"IF(AgencyCode=\"\",\"\",AgencyCode)","v":""},null,{"$f":"IF(AgencyName=\"\",\"\",AgencyName)","v":""}]
[null,"Bus. Area",null,"Name"]
[]
[]
["Name of Claim-Paying Program/Type of Self-Insured Risk:"]
[]
[]
["Fund:"]
[]
[]
[]
[null,null,"Description",null,null,null,null,null,"Dollar Amount"]
[]
[]
["Liability for Claims that the agency paid or plans to process for payment in the "]
["     extended 12th period of the current fiscal year (marked as \"Prior Year Payable\").",null,null,null,null,null,null,null,"$"]
[]
[]
["Liability for Claims that the agency plans to pay during period 1 - 12 of"]
["     the next fiscal year.",null,null,null,null,null,null,null,"$"]
[]
[]
["Liability for Claims that the agency plans to pay after June 30 of next fiscal year",null,null,null,null,null,null,null,"$"]
[]
[]
{"$rows_left_out":6}
{"sheet":"3.15.1 (Cont 4)","index":6,"n_rows":34,"n_cols":10,"rows_kept":34,"cut":false,"hidden":true,"merged":[[20,0,20,7],[23,0,23,7],[24,0,24,7],[27,0,27,7],[5,3,5,8],[9,5,9,9],[16,2,16,7],[17,0,17,1],[19,0,19,7]]}
["STATE OF SOUTH CAROLINA"]
["CLAIMS SUMMARY FORM"]
[null,null,null,null,"At June 30,",{"$f":"IF(Year=\"\",\"\",Year)","v":""}]
[]
[]
["Agency:",{"$f":"IF(AgencyCode=\"\",\"\",AgencyCode)","v":""},null,{"$f":"IF(AgencyName=\"\",\"\",AgencyName)","v":""}]
[null,"Bus. Area",null,"Name"]
[]
[]
["Name of Claim-Paying Program/Type of Self-Insured Risk:"]
[]
[]
["Fund:"]
[]
[]
[]
[null,null,"Description",null,null,null,null,null,"Dollar Amount"]
[]
[]
["Liability for Claims that the agency paid or plans to process for payment in the "]
["     extended 12th period of the current fiscal year (marked as \"Prior Year Payable\").",null,null,null,null,null,null,null,"$"]
[]
[]
["Liability for Claims that the agency plans to pay during period 1 - 12 of"]
["     the next fiscal year.",null,null,null,null,null,null,null,"$"]
[]
[]
["Liability for Claims that the agency plans to pay after June 30 of next fiscal year",null,null,null,null,null,null,null,"$"]
[]
[]
{"$rows_left_out":5}
{"sheet":"3.15.1 (Cont 5)","index":7,"n_rows":36,"n_cols":10,"rows_kept":36,"cut":false,"hidden":true,"merged":[[20,0,20,7],[23,0,23,7],[24,0,24,7],[27,0,27,7],[5,3,5,8],[9,5,9,9],[16,2,16,7],[17,0,17,1],[19,0,19,7]]}
["STATE OF SOUTH CAROLINA"]
["CLAIMS SUMMARY FORM"]
[null,null,null,null,"At June 30,",{"$f":"IF(Year=\"\",\"\",Year)","v":""}]
[]
[]
["Agency:",{"$f":"IF(AgencyCode=\"\",\"\",AgencyCode)","v":""},null,{"$f":"IF(AgencyName=\"\",\"\",AgencyName)","v":""}]
[null,"Bus. Area",null,"Name"]
[]
[]
["Name of Claim-Paying Program/Type of Self-Insured Risk:"]
[]
[]
["Fund:"]
[]
[]
[]
[null,null,"Description",null,null,null,null,null,"Dollar Amount"]
[]
[]
["Liability for Claims that the agency paid or plans to process for payment in the "]
["     extended 12th period of the current fiscal year (marked as \"Prior Year Payable\").",null,null,null,null,null,null,null,"$"]
[]
[]
["Liability for Claims that the agency plans to pay during period 1 - 12 of"]
["     the next fiscal year.",null,null,null,null,null,null,null,"$"]
[]
[]
["Liability for Claims that the agency plans to pay after June 30 of next fiscal year",null,null,null,null,null,null,null,"$"]
[]
[]
{"$rows_left_out":7}
{"sheet":"3.15.2","index":8,"n_rows":51,"n_cols":5,"rows_kept":51,"cut":false,"hidden":false,"merged":[[32,1,35,11],[40,1,43,11],[36,0,36,10],[25,0,25,10],[8,3,8,9],[5,3,5,9],[19,0,19,1],[13,5,13,11],[13,0,13,4],[21,1,24,11]]}
["STATE OF SOUTH CAROLINA"]
["ADDITIONAL CLAIMS INFORMATION FORM"]
[null,null,null,null,"At June 30,"]
[]
[]
["Agency:",{"$f":"IF(AgencyCode=\"\",\"\",AgencyCode)","v":""},null,{"$f":"IF(AgencyName=\"\",\"\",AgencyName)","v":""}]
[null,"Bus. Area",null,"Name"]
[]
["Preparer (Type Name):"]
[]
["Reviewer (Type Name):"]
[]
[]
["Name of Claim-Paying Program/Type of Self-Insured Risk:"]
[]
[]
["Is this the initial (Year-end) report or an update of information:"]
[]
["Date through which the update is provided"]
[]
["Please briefly explain how you compute claims known but not paid for claims in process at the valuation date."]
[]
[]
[]
[]
[]
[]
[]
["Did an actuary compute the IBNR?"]
["If YES, please attach a copy of the actuary's report."]
{"$rows_left_out":22}
{"sheet":"3.15.2 (Cont 1)","index":9,"n_rows":43,"n_cols":4,"rows_kept":43,"cut":false,"hidden":true,"merged":[[27,1,30,11],[31,0,31,10],[35,1,38,11],[14,0,14,1],[4,3,4,9],[8,0,8,4],[8,5,8,11],[16,1,19,11],[20,0,20,10]]}
["STATE OF SOUTH CAROLINA"]
["ADDITIONAL CLAIMS INFORMATION FORM"]
[]
[]
["Agency:",{"$f":"IF(AgencyCode=\"\",\"\",AgencyCode)","v":""},null,{"$f":"IF(AgencyName=\"\",\"\",AgencyName)","v":""}]
[null,"Bus. Area",null,"Name"]
[]
[]
["Name of Claim-Paying Program/Type of Self-Insured Risk:"]
[]
[]
["Is this the initial (Year-end) report or an update of information:"]
[]
["Date through which the update is provided"]
[]
["Please briefly explain how you compute claims known but not paid for claims in process at the valuation date."]
[]
[]
[]
[]
[]
[]
[]
["Did an actuary compute the IBNR?"]
["If YES, please attach a copy of the actuary's report."]
[]
["If NO, Please briefly explain how you compute claims incurred but not reported (IBNR) at the valuation date."]
[]
[]
[]
{"$rows_left_out":14}
{"sheet":"3.15.2 (Cont 2)","index":10,"n_rows":43,"n_cols":4,"rows_kept":43,"cut":false,"hidden":true,"merged":[[27,1,30,11],[31,0,31,10],[35,1,38,11],[14,0,14,1],[4,3,4,9],[8,0,8,4],[8,5,8,11],[16,1,19,11],[20,0,20,10]]}
["STATE OF SOUTH CAROLINA"]
["ADDITIONAL CLAIMS INFORMATION FORM"]
[]
[]
["Agency:",{"$f":"IF(AgencyCode=\"\",\"\",AgencyCode)","v":""},null,{"$f":"IF(AgencyName=\"\",\"\",AgencyName)","v":""}]
[null,"Bus. Area",null,"Name"]
[]
[]
["Name of Claim-Paying Program/Type of Self-Insured Risk:"]
[]
[]
["Is this the initial (Year-end) report or an update of information:"]
[]
["Date through which the update is provided"]
[]
["Please briefly explain how you compute claims known but not paid for claims in process at the valuation date."]
[]
[]
[]
[]
[]
[]
[]
["Did an actuary compute the IBNR?"]
["If YES, please attach a copy of the actuary's report."]
[]
["If NO, Please briefly explain how you compute claims incurred but not reported (IBNR) at the valuation date."]
[]
[]
[]
{"$rows_left_out":14}
{"sheet":"3.15.2 (Cont 3)","index":11,"n_rows":43,"n_cols":4,"rows_kept":43,"cut":false,"hidden":true,"merged":[[27,1,30,11],[31,0,31,10],[35,1,38,11],[14,0,14,1],[4,3,4,9],[8,0,8,4],[8,5,8,11],[16,1,19,11],[20,0,20,10]]}
["STATE OF SOUTH CAROLINA"]
["ADDITIONAL CLAIMS INFORMATION FORM"]
[]
[]
["Agency:",{"$f":"IF(AgencyCode=\"\",\"\",AgencyCode)","v":""},null,{"$f":"IF(AgencyName=\"\",\"\",AgencyName)","v":""}]
[null,"Bus. Area",null,"Name"]
[]
[]
["Name of Claim-Paying Program/Type of Self-Insured Risk:"]
[]
[]
["Is this the initial (Year-end) report or an update of information:"]
[]
["Date through which the update is provided"]
[]
["Please briefly explain how you compute claims known but not paid for claims in process at the valuation date."]
[]
[]
[]
[]
[]
[]
[]
["Did an actuary compute the IBNR?"]
["If YES, please attach a copy of the actuary's report."]
[]
["If NO, Please briefly explain how you compute claims incurred but not reported (IBNR) at the valuation date."]
[]
[]
[]
{"$rows_left_out":14}
{"sheet":"3.15.2 (Cont 4)","index":12,"n_rows":43,"n_cols":4,"rows_kept":43,"cut":false,"hidden":true,"merged":[[27,1,30,11],[31,0,31,10],[35,1,38,11],[14,0,14,1],[4,3,4,9],[8,0,8,4],[8,5,8,11],[16,1,19,11],[20,0,20,10]]}
["STATE OF SOUTH CAROLINA"]
["ADDITIONAL CLAIMS INFORMATION FORM"]
[]
[]
["Agency:",{"$f":"IF(AgencyCode=\"\",\"\",AgencyCode)","v":""},null,{"$f":"IF(AgencyName=\"\",\"\",AgencyName)","v":""}]
[null,"Bus. Area",null,"Name"]
[]
[]
["Name of Claim-Paying Program/Type of Self-Insured Risk:"]
[]
[]
["Is this the initial (Year-end) report or an update of information:"]
[]
["Date through which the update is provided"]
[]
["Please briefly explain how you compute claims known but not paid for claims in process at the valuation date."]
[]
[]
[]
[]
[]
[]
[]
["Did an actuary compute the IBNR?"]
["If YES, please attach a copy of the actuary's report."]
[]
["If NO, Please briefly explain how you compute claims incurred but not reported (IBNR) at the valuation date."]
[]
[]
[]
{"$rows_left_out":14}
{"sheet":"3.15.2 (Cont 5)","index":13,"n_rows":45,"n_cols":4,"rows_kept":45,"cut":false,"hidden":true,"merged":[[44,0,44,11],[14,0,14,1],[4,3,4,9],[8,0,8,4],[8,5,8,11],[16,1,19,11],[20,0,20,10],[27,1,30,11],[31,0,31,10],[35,1,38,11]]}
["STATE OF SOUTH CAROLINA"]
["ADDITIONAL CLAIMS INFORMATION FORM"]
[]
[]
["Agency:",{"$f":"IF(AgencyCode=\"\",\"\",AgencyCode)","v":""},null,{"$f":"IF(AgencyName=\"\",\"\",AgencyName)","v":""}]
[null,"Bus. Area",null,"Name"]
[]
[]
["Name of Claim-Paying Program/Type of Self-Insured Risk:"]
[]
[]
["Is this the initial (Year-end) report or an update of information:"]
[]
["Date through which the update is provided"]
[]
["Please briefly explain how you compute claims known but not paid for claims in process at the valuation date."]
[]
[]
[]
[]
[]
[]
[]
["Did an actuary compute the IBNR?"]
["If YES, please attach a copy of the actuary's report."]
[]
["If NO, Please briefly explain how you compute claims incurred but not reported (IBNR) at the valuation date."]
[]
[]
[]
{"$rows_left_out":16}
{"sheet":"3.15.3","index":14,"n_rows":45,"n_cols":7,"rows_kept":45,"cut":false,"hidden":false,"merged":[]}
["STATE OF SOUTH CAROLINA"]
["CLAIMS REPORTING PACKAGE"]
["REVIEWER CHECKLIST"]
[null,null,null,null,null,"FISCAL YEAR",{"$f":"'Signature 1'!Year","v":2019}]
[]
["Reviewer's Responses for the Claims Summary Form (Form 3.15.1):"]
[{"$f":"COUNT(A$6:A6)+1","v":1},"Has a separate form been completed for each claim-paying program?"]
[]
[{"$f":"COUNT(A$6:A8)+1","v":2},"Has the claim-paying program or type of self-insured risk been properly identified?"]
[]
[{"$f":"COUNT(A$6:A10)+1","v":3},"Is the fund number provided accurate for the current year and the claim-paying "]
[null,"program?"]
[]
[{"$f":"COUNT(A$6:A13)+1","v":4},"Has the current claims liability been split between amounts to be processed in "]
[null,"the extended period 12 of the current fiscal year and amounts to be paid "]
[null,"during the next fiscal year?"]
[]
["Reviewer's Responses for the Additional Claims Information Form (Form 3.15.2):"]
[{"$f":"COUNT(A$6:A17)+1","v":5},"If the initial reporting, has an equal number of this form been completed for each "]
[null,"completed Form 3.15.1?"]
[]
[{"$f":"COUNT(A$6:A20)+1","v":6},"Is the period for which reporting is being provided accurately reflected?"]
[]
[{"$f":"COUNT(A$6:A22)+1","v":7},"If the subsequent reporting, has the date through which information is being provided"]
[null,"accurately reported?"]
[]
[{"$f":"COUNT(A$6:A25)+1","v":8},"Are the explanations and descriptions provided in sufficient detail for someone "]
[null,"unfamiliar with the operations of the agency and this claim-paying program "]
[null,"to understand?"]
[]
{"$rows_left_out":16}
{"sheet":"Summary","index":15,"n_rows":196,"n_cols":7,"rows_kept":196,"cut":false,"hidden":true,"merged":[]}
["Worksheet","Agnecy Code","Agency Name","Year","QUESTION","Cell","Answers"]
["3.15.1",{"$f":"IF(AgencyCode=\"\",\"\",AgencyCode)","v":""},{"$f":"IF(AgencyName=\"\",\"\",AgencyName)","v":""},{"$f":"IF(Year=\"\",\"\",Year)","v":""},"Prepared Date","B9",{"$f":"IF('3.15.1'!#REF!=\"\",\"\",'3.15.1'!#REF!)","v":{"$error":"#REF!"}}]
["3.15.1","","","","Preparers Title","D12:F12",{"$f":"IF('3.15.1'!#REF!=\"\",\"\",'3.15.1'!#REF!)","v":{"$error":"#REF!"}}]
["3.15.1","","","","Preparers eMail","H9:K9",{"$f":"IF('3.15.1'!#REF!=\"\",\"\",'3.15.1'!#REF!)","v":{"$error":"#REF!"}}]
["3.15.1","","","","Preparers Phone No","H12",{"$f":"IF('3.15.1'!#REF!=\"\",\"\",'3.15.1'!#REF!)","v":{"$error":"#REF!"}}]
["3.15.1","","","","Approved Date","B14",{"$f":"IF('3.15.1'!#REF!=\"\",\"\",'3.15.1'!#REF!)","v":{"$error":"#REF!"}}]
["3.15.1","","","","Approvers Title","D17:F17",{"$f":"IF('3.15.1'!#REF!=\"\",\"\",'3.15.1'!#REF!)","v":{"$error":"#REF!"}}]
["3.15.1","","","","Approvers eMail","H14:K14",{"$f":"IF('3.15.1'!#REF!=\"\",\"\",'3.15.1'!#REF!)","v":{"$error":"#REF!"}}]
["3.15.1","","","","Approvers Phone No","H17",{"$f":"IF('3.15.1'!#REF!=\"\",\"\",'3.15.1'!#REF!)","v":{"$error":"#REF!"}}]
["3.15.1","","","","Name of Claim-Paying Program/Type of Self-Insured Risk:","F20:K20",{"$f":"IF('3.15.1'!F14=\"\",\"\",'3.15.1'!F14)","v":""}]
["3.15.1","","","","Fund:","B23",{"$f":"IF('3.15.1'!B17=\"\",\"\",'3.15.1'!B17)","v":""}]
["3.15.1","","","","Liability for Claims that the agency paid or plans to process for payment in the extended 12th period of the current fiscal year (marked as \"Prior Year Payable\").","J31:K31",{"$f":"IF('3.15.1'!J25=\"\",\"\",'3.15.1'!J25)","v":""}]
["3.15.1","","","","Liability for Claims that the agency plans to pay during period 1 - 12 of  the next fiscal year.","J35:K35",{"$f":"IF('3.15.1'!J29=\"\",\"\",'3.15.1'!J29)","v":""}]
["3.15.1","","","","Liability for Claims that the agency plans to pay after June 30 of next fiscal year","J38:K38",{"$f":"IF('3.15.1'!J32=\"\",\"\",'3.15.1'!J32)","v":""}]
["3.15.1","","","","Total Claims to be Paid by this Fund","J42:K42",{"$f":"IF('3.15.1'!J36=\"\",\"\",'3.15.1'!J36)","v":0}]
["3.15.2","","","","Prepared Date","B8",{"$f":"IF('3.15.2'!#REF!=\"\",\"\",'3.15.2'!#REF!)","v":{"$error":"#REF!"}}]
["3.15.2","","","","Preparers Title","D11:G11",{"$f":"IF('3.15.2'!#REF!=\"\",\"\",'3.15.2'!#REF!)","v":{"$error":"#REF!"}}]
["3.15.2","","","","Preparers eMail","K8:M8",{"$f":"IF('3.15.2'!#REF!=\"\",\"\",'3.15.2'!#REF!)","v":{"$error":"#REF!"}}]
["3.15.2","","","","Preparers Phone No","J11:L11",{"$f":"IF('3.15.2'!#REF!=\"\",\"\",'3.15.2'!#REF!)","v":{"$error":"#REF!"}}]
["3.15.2","","","","Approved Date","B13",{"$f":"IF('3.15.2'!#REF!=\"\",\"\",'3.15.2'!#REF!)","v":{"$error":"#REF!"}}]
["3.15.2","","","","Approvers Title","D16:G16",{"$f":"IF('3.15.2'!#REF!=\"\",\"\",'3.15.2'!#REF!)","v":{"$error":"#REF!"}}]
["3.15.2","","","","Approvers eMail","K13:M13",{"$f":"IF('3.15.2'!#REF!=\"\",\"\",'3.15.2'!#REF!)","v":{"$error":"#REF!"}}]
["3.15.2","","","","Approvers Phone No","J16:L16",{"$f":"IF('3.15.2'!#REF!=\"\",\"\",'3.15.2'!#REF!)","v":{"$error":"#REF!"}}]
["3.15.2","","","","Name of Claim-Paying Program/Type of Self-Insured Risk:","G19:M19",{"$f":"IF('3.15.2'!F14=\"\",\"\",'3.15.2'!F14)","v":""}]
["3.15.2","","","","Is this the initial (Year-end) report or an update of information:","I22:J22",{"$f":"IF('3.15.2'!H17=\"\",\"\",'3.15.2'!H17)","v":""}]
["3.15.2","","","","Date through which the update is provided","I24",{"$f":"IF('3.15.2'!H19=\"\",\"\",'3.15.2'!H19)","v":""}]
["3.15.2","","","","Please briefly explain how you compute claims known but not paid for claims in process at the valuation date.","B27:M30",{"$f":"IF('3.15.2'!B22=\"\",\"\",'3.15.2'!B22)","v":""}]
["3.15.2","","","","Did an actuary compute the IBNR?","J34",{"$f":"IF('3.15.2'!I29=\"\",\"\",'3.15.2'!I29)","v":""}]
["3.15.2","","","","If NO, Please briefly explain how you compute claims incurred but not reported (IBNR) at the valuation date.","B38:M41",{"$f":"IF('3.15.2'!B33=\"\",\"\",'3.15.2'!B33)","v":""}]
["3.15.2","","","","Since the last Additional Claims Information Form you submitted, has anything happened that may materially change future claims costs?","J44",{"$f":"IF('3.15.2'!I39=\"\",\"\",'3.15.2'!I39)","v":""}]
{"$rows_left_out":166}