{"text_format":"1","workbook":"xlsx","n_sheets":8,"sheets":["Instructions","Signature Page","3.06.1 ","3.06.1 (2)","Reviewer Checklist","Package Response","Inventory JE Prep INV01","Business Area Lookup"],"not_rendered":{"charts":0,"images":0,"macros":1,"external_links":1,"defined_names":8,"comments":0,"pivot_tables":0},"unopened":[],"bounds":{"document_bytes":16777216,"sheet_cells":100000,"rows_first":2000,"rows_last":500,"rows_between":2000,"halvings":0,"cell_chars":16384,"cell_head_chars":4096},"cells_cut":0,"cells_raw":0,"read":"whole","date_system":"1900"}

{"sheet":"Instructions","index":0,"n_rows":60,"n_cols":6,"rows_kept":60,"cut":false,"hidden":false,"merged":[[0,0,0,9],[40,1,40,10],[56,4,56,6],[44,4,44,6],[2,0,2,9],[1,0,1,9]]}
["State of South Carolina"]
["Section 3.06, Inventory Reporting Package"]
["Fiscal Year 2019 GAAP Reporting"]
[]
[null,"Purpose and Objective:"]
[null,"It is the State's policy to report the value of United States Department of Agriculture food supplies "]
[null,"(commodities) on hand as of the end of the fiscal year as inventory.  This reporting package collects "]
[null,"information regarding the value of inventories held by agencies."]
[]
[null,"The agency is responsible for tracking items held in inventory and valuing that inventory as of June 30."]
[null,"The physical count of inventory is an important control for protecting assets and accurate reporting that "]
[null,"should be performed at least annually.  Therefore the agency is required to perform a physical count of "]
[null,"inventory as close to year-end as possible.  See the Reporting Policies and Procedures Manual for "]
[null,"further guidance."]
[]
[null,"If questions arise that can not be answered by the Reporting Policies and Procedures Manual, please contact"]
[null,"the Financial Reporting Division of the Comptroller General's Office."]
[]
[null,"Instructions for Completion of the Form(s):"]
[null,"Use the macro button to create as many copies of the form(s) as is required."]
{"$rows_left_out":41}
{"sheet":"Signature Page","index":1,"n_rows":64,"n_cols":7,"rows_kept":64,"cut":false,"hidden":false,"merged":[[63,1,63,5],[35,1,35,5],[57,1,57,5],[58,1,58,5],[59,1,59,5],[60,1,60,5],[61,1,61,5],[62,1,62,5],[56,1,56,5],[41,1,41,5],[43,1,43,5],[45,1,45,5],[47,1,47,5],[49,1,49,5],[50,1,50,5],[51,1,51,5],[17,4,17,5],[52,1,52,5],[53,1,53,5],[54,1,54,5],[55,1,55,5],[31,4,31,5],[3,1,3,6],[2,1,2,6],[1,1,1,6],[0,1,0,6],[29,4,29,5],[5,4,5,5],[6,4,6,5],[19,4,19,5],[21,4,21,5],[23,4,23,5],[25,4,25,5],[27,4,27,5],[9,4,9,5],[11,4,11,5],[13,4,13,5],[15,4,15,5]]}
[null,"State of South Carolina"]
[null,"Section 3.06, Inventory Reporting Package"]
[null,"Signature Page"]
[null,"Fiscal Year 2019"]
[]
[null,null,"Agency",null,{"$f":"IF(C6=\"\",\"\",VLOOKUP(C6,'Business Area Lookup'!A5:B85,2,FALSE))","v":"Agency Name"}]
[null,null,"Business Area",null,"Agency Name"]
[]
[]
[null,null,"Preparer","Signature:",null,null," "]
[]
[null,null,null,"Date:",null,null," "]
[]
[null,null,null,"Name:",null,null," "]
[]
[null,null,null,"Title:",null,null," "]
[]
[null,null,null,"e-mail:",null,null," "]
[]
[null,null,null,"Phone Number:",null,null," "]
{"$rows_left_out":45}
{"sheet":"3.06.1 ","index":2,"n_rows":54,"n_cols":16,"rows_kept":54,"cut":false,"hidden":false,"merged":[[47,1,47,3],[47,9,47,10],[48,1,48,3],[48,9,48,10],[46,1,46,3],[46,9,46,10],[39,9,39,10],[41,9,41,10],[42,9,42,10],[43,9,43,10],[44,9,44,10],[32,1,32,3],[32,9,32,10],[0,0,0,11],[5,0,5,2],[6,0,6,2],[6,5,6,10],[2,0,2,11],[3,0,3,11],[1,0,1,11],[30,1,30,3],[30,9,30,10],[31,1,31,3],[31,9,31,10],[9,8,9,10],[28,9,28,10],[7,0,7,2],[7,5,7,10],[12,0,12,2],[26,0,26,2],[24,1,24,10],[9,3,9,5],[44,1,44,3],[45,1,45,3],[33,9,33,10],[37,1,37,3],[37,9,37,10],[34,9,34,10],[35,1,35,3],[35,9,35,10],[36,1,36,3],[36,9,36,10],[42,1,42,3],[43,1,43,3],[41,1,41,3],[34,1,34,3],[33,1,33,3],[45,9,45,10]]}
["State of South Carolina"]
["Section 3.06, Inventory Reporting Package"]
["Inventory Summary Form"]
["At June 30, 2019"]
[]
[]
["  Agency:",null,null,{"$f":"'Signature Page'!C6","v":"Agency"},null,{"$f":"IF(AgencyCode=\"\",\"\",VLOOKUP(AgencyCode,'Business Area Lookup'!A4:C85,2,FALSE))","v":"Agency Name"}]
[null,null,null,null,null,"Agency Name"]
[]
[null,"Preparer:",null,null,null,null,null,"Reviewer:"]
[null,null,null,null,"(Type Name)",null,null,null,null,"(Type Name)"]
[]
[]
["The report provided is based on what is recorded in SCEIS for your agency, the amount from the report should be",null,null,null,null,null,null,null,null,null,null,null,null,null,null,0]
["adjusted to actual inventory."]
[]
["Total dollar amount from the SCEIS Inventory report provided",null,null,null,null,null,null,null,null,"$"]
[]
["Does the report provided accurately report all inventory balances as of June 30?"]
[]
{"$rows_left_out":35}
{"sheet":"3.06.1 (2)","index":3,"n_rows":44,"n_cols":10,"rows_kept":44,"cut":false,"hidden":false,"merged":[[0,0,0,11],[1,0,1,11],[2,0,2,11],[3,0,3,11],[9,3,9,5],[9,8,9,10],[12,0,12,2],[27,9,27,10],[5,0,5,2],[6,0,6,2],[6,5,6,10],[7,0,7,2],[7,5,7,10],[14,9,14,10],[16,1,16,3],[16,9,16,10],[17,1,17,3],[17,9,17,10],[18,1,18,3],[18,9,18,10],[19,1,19,3],[19,9,19,10],[31,1,31,3],[31,9,31,10],[36,1,36,3],[36,9,36,10],[29,1,29,3],[29,9,29,10],[30,1,30,3],[30,9,30,10],[32,1,32,3],[32,9,32,10],[38,1,38,3],[38,9,38,10],[33,1,33,3],[33,9,33,10],[34,1,34,3],[34,9,34,10],[35,1,35,3],[35,9,35,10],[37,1,37,3],[37,9,37,10],[20,1,20,3],[20,9,20,10],[24,1,24,3],[24,9,24,10],[25,1,25,3],[25,9,25,10],[21,1,21,3],[21,9,21,10],[22,1,22,3],[22,9,22,10],[23,1,23,3],[23,9,23,10]]}
["State of South Carolina"]
["Section 3.06, Inventory Reporting Package"]
["Inventory Summary Form"]
["At June 30, 2019"]
[]
[]
["  Agency:",null,null,{"$f":"IF('3.06.1 '!AgencyCode=\"\",\"\",'3.06.1 '!AgencyCode)","v":"Agency"},null,{"$f":"IF('3.06.1 '!F7=\"\",\"\",'3.06.1 '!F7)","v":"Agency Name"}]
[null,null,null,"Business Area",null,"Agency Name"]
[]
[null,"Preparer:",null,{"$f":"IF('3.06.1 '!D10=\"\",\"\",'3.06.1 '!D10)","v":""},null,null,null,"Reviewer:",{"$f":"IF('3.06.1 '!I10=\"\",\"\",'3.06.1 '!I10)","v":""}]
[null,null,null,null,"(Type Name)",null,null,null,null,"(Type Name)"]
[]
[]
[null,"Add additional amounts that should be reported on this package but are not included on the Inventory report:"]
[null,null,null,null,null,"Fund",null,"Dollar Amount","Exp Acct","Comments"]
[]
[null,null,null,null,null,null,"$"]
[]
[]
[]
{"$rows_left_out":25}
{"sheet":"Reviewer Checklist","index":4,"n_rows":38,"n_cols":8,"rows_kept":38,"cut":false,"hidden":false,"merged":[[0,1,0,11],[1,1,1,11],[2,1,2,11],[3,1,3,11]]}
[null,"State of South Carolina"]
[null,"Section 3.06, Inventory Reporting Package"]
[null,"Reviewer Checklist"]
[null,"Fiscal Year 2019"]
[]
[null,null,{"$f":"IF('3.06.1 '!AgencyCode=\"\",\"\",'3.06.1 '!AgencyCode)","v":"Agency"}]
[null,null,"Business Area",null,null,null,null,"Date Last Review Step Was Completed:   "]
[]
["Reviewer's Responses:"]
[{"$f":"IF(B10=\"y\",COUNTA(B$9:B10),\"\")","v":1},"y","Is the reviewer of the form(s) someone other than the person who prepared it?"]
[{"$f":"IF(B11=\"y\",COUNTA(B$9:B11),\"\")","v":""}]
[{"$f":"IF(B12=\"y\",COUNTA(B$9:B12),\"\")","v":2},"y","Is the contact information (i.e. title, email, and telephone number) for the preparer"]
[{"$f":"IF(B13=\"y\",COUNTA(B$9:B13),\"\")","v":""},null," and reviewer accurately reported on the signature page?"]
[{"$f":"IF(B14=\"y\",COUNTA(B$9:B14),\"\")","v":""}]
[{"$f":"IF(B15=\"y\",COUNTA(B$9:B15),\"\")","v":3},"y","Has all inventory been accounted for and included in the official agency accounting "]
[{"$f":"IF(B16=\"y\",COUNTA(B$9:B16),\"\")","v":""},null,"records?"]
[{"$f":"IF(B17=\"y\",COUNTA(B$9:B17),\"\")","v":""}]
[{"$f":"IF(B18=\"y\",COUNTA(B$9:B18),\"\")","v":4},"y","Can all amounts reported on each form be traced to official agency "]
[{"$f":"IF(B19=\"y\",COUNTA(B$9:B19),\"\")","v":""},null,"accounting records?"]
[{"$f":"IF(B20=\"y\",COUNTA(B$9:B20),\"\")","v":""}]
{"$rows_left_out":19}
{"sheet":"Package Response","index":5,"n_rows":47,"n_cols":14,"rows_kept":47,"cut":false,"hidden":true,"merged":[]}
["Line","Business Area","CAFR Business Area","Agency Name","SCEIS Balance","Actual SCEIS Report","SCEIS Report Check","Is Report Accurate?","Value Based on Physical Count","Fund","Amount","GL Account","Comments","Line Text"]
[1,{"$f":"'3.06.1 '!AgencyCode","v":"Agency"},{"$f":"VLOOKUP(B2,'Business Area Lookup'!A6:C86,3,FALSE)","v":{"$error":"#N/A"}},{"$f":"'3.06.1 '!AgencyName","v":"Agency Name"},{"$f":"'3.06.1 '!$K$17","v":0},null,null,{"$f":"'3.06.1 '!$K$19","v":0},{"$f":"'3.06.1 '!$K$23","v":0},{"$f":"'3.06.1 '!F31","v":0},{"$f":"'3.06.1 '!H31","v":0},{"$f":"'3.06.1 '!I31","v":0},{"$f":"'3.06.1 '!J31","v":0},{"$f":"\"Inventory Adjustment - \"&B2&\" Row \"&A2","v":"Inventory Adjustment - Agency Row 1"}]
[2,{"$f":"B2","v":"Agency"},{"$f":"C2","v":{"$error":"#N/A"}},{"$f":"D2","v":"Agency Name"},null,null,null,null,null,{"$f":"'3.06.1 '!F32","v":0},{"$f":"'3.06.1 '!H32","v":0},{"$f":"'3.06.1 '!I32","v":0},{"$f":"'3.06.1 '!J32","v":0},{"$f":"\"Inventory Adjustment - \"&B3&\" Row \"&A3","v":"Inventory Adjustment - Agency Row 2"}]
[3,{"$f":"B3","v":"Agency"},{"$f":"C3","v":{"$error":"#N/A"}},{"$f":"D3","v":"Agency Name"},null,null,null,null,null,{"$f":"'3.06.1 '!F33","v":0},{"$f":"'3.06.1 '!H33","v":0},{"$f":"'3.06.1 '!I33","v":0},{"$f":"'3.06.1 '!J33","v":0},"Inventory Adjustment - Agency Row 3"]
[4,"Agency",{"$error":"#N/A"},"Agency Name",null,null,null,null,null,{"$f":"'3.06.1 '!F34","v":0},{"$f":"'3.06.1 '!H34","v":0},{"$f":"'3.06.1 '!I34","v":0},{"$f":"'3.06.1 '!J34","v":0},"Inventory Adjustment - Agency Row 4"]
[5,"Agency",{"$error":"#N/A"},"Agency Name",null,null,null,null,null,{"$f":"'3.06.1 '!F35","v":0},{"$f":"'3.06.1 '!H35","v":0},{"$f":"'3.06.1 '!I35","v":0},{"$f":"'3.06.1 '!J35","v":0},"Inventory Adjustment - Agency Row 5"]
[6,"Agency",{"$error":"#N/A"},"Agency Name",null,null,null,null,null,{"$f":"'3.06.1 '!F36","v":0},{"$f":"'3.06.1 '!H36","v":0},{"$f":"'3.06.1 '!I36","v":0},{"$f":"'3.06.1 '!J36","v":0},"Inventory Adjustment - Agency Row 6"]
[7,"Agency",{"$error":"#N/A"},"Agency Name",null,null,null,null,null,{"$f":"'3.06.1 '!F37","v":0},{"$f":"'3.06.1 '!H37","v":0},{"$f":"'3.06.1 '!I37","v":0},{"$f":"'3.06.1 '!J37","v":0},"Inventory Adjustment - Agency Row 7"]
[8,"Agency",{"$error":"#N/A"},"Agency Name",null,null,null,null,null,{"$f":"'3.06.1 '!F38","v":0},{"$f":"'3.06.1 '!H38","v":0},{"$f":"'3.06.1 '!I38","v":0},{"$f":"'3.06.1 '!J38","v":0},"Inventory Adjustment - Agency Row 8"]
[]
[9,{"$f":"B9","v":"Agency"},{"$f":"C9","v":{"$error":"#N/A"}},{"$f":"D9","v":"Agency Name"},null,null,null,null,null,{"$f":"'3.06.1 '!F42","v":0},{"$f":"-'3.06.1 '!H42","v":0},{"$f":"'3.06.1 '!I42","v":0},{"$f":"'3.06.1 '!J42","v":0},{"$f":"\"Inventory Adjustment - \"&B11&\" Row \"&A11","v":"Inventory Adjustment - Agency Row 9"}]
[10,{"$f":"B11","v":"Agency"},{"$f":"C11","v":{"$error":"#N/A"}},{"$f":"D11","v":"Agency Name"},null,null,null,null,null,{"$f":"'3.06.1 '!F43","v":0},{"$f":"-'3.06.1 '!H43","v":0},{"$f":"'3.06.1 '!I43","v":0},{"$f":"'3.06.1 '!J43","v":0},"Inventory Adjustment - Agency Row 10"]
[11,{"$f":"B12","v":"Agency"},{"$f":"C12","v":{"$error":"#N/A"}},{"$f":"D12","v":"Agency Name"},null,null,null,null,null,{"$f":"'3.06.1 '!F44","v":0},{"$f":"-'3.06.1 '!H44","v":0},{"$f":"'3.06.1 '!I44","v":0},{"$f":"'3.06.1 '!J44","v":0},"Inventory Adjustment - Agency Row 11"]
[12,"Agency",{"$error":"#N/A"},"Agency Name",null,null,null,null,null,{"$f":"'3.06.1 '!F45","v":0},{"$f":"-'3.06.1 '!H45","v":0},{"$f":"'3.06.1 '!I45","v":0},{"$f":"'3.06.1 '!J45","v":0},"Inventory Adjustment - Agency Row 12"]
[13,"Agency",{"$error":"#N/A"},"Agency Name",null,null,null,null,null,{"$f":"'3.06.1 '!F46","v":0},{"$f":"-'3.06.1 '!H46","v":0},{"$f":"'3.06.1 '!I46","v":0},{"$f":"'3.06.1 '!J46","v":0},"Inventory Adjustment - Agency Row 13"]
[14,"Agency",{"$error":"#N/A"},"Agency Name",null,null,null,null,null,{"$f":"'3.06.1 '!F47","v":0},{"$f":"-'3.06.1 '!H47","v":0},{"$f":"'3.06.1 '!I47","v":0},{"$f":"'3.06.1 '!J47","v":0},"Inventory Adjustment - Agency Row 14"]
[15,"Agency",{"$error":"#N/A"},"Agency Name",null,null,null,null,null,{"$f":"'3.06.1 '!F48","v":0},{"$f":"-'3.06.1 '!H48","v":0},{"$f":"'3.06.1 '!I48","v":0},{"$f":"'3.06.1 '!J48","v":0},"Inventory Adjustment - Agency Row 15"]
[16,{"$f":"B17","v":"Agency"},{"$error":"#N/A"},"Agency Name",null,null,null,null,null,{"$f":"'3.06.1 '!F49","v":0},{"$f":"-'3.06.1 '!H49","v":0},{"$f":"'3.06.1 '!I49","v":0},{"$f":"'3.06.1 '!J49","v":0},"Inventory Adjustment - Agency Row 16"]
[]
[17,{"$f":"'3.06.1 '!AgencyCode","v":"Agency"},{"$f":"C18","v":{"$error":"#N/A"}},{"$f":"'3.06.1 '!AgencyName","v":"Agency Name"},null,null,null,null,null,{"$f":"'3.06.1 (2)'!F17","v":0},{"$f":"'3.06.1 (2)'!H17","v":0},{"$f":"'3.06.1 (2)'!I17","v":0},{"$f":"'3.06.1 (2)'!J17","v":0},{"$f":"\"Inventory Adjustment - \"&B20&\" Row \"&A20","v":"Inventory Adjustment - Agency Row 17"}]
{"$rows_left_out":28}
{"sheet":"Inventory JE Prep INV01","index":6,"n_rows":83,"n_cols":31,"rows_kept":83,"cut":false,"hidden":true,"merged":[]}
["O-1-1-03 Pkg Resp",null,null,null,null,null,null,null,null,null,null,null,"INV01",null,null,null,null,{"$f":"SUMIF(S$5:S$76,S1,R$5:R$76)","v":0},"D"]
[null,null,null,null,null,null,null,null,null,null,null,2019,null,null,null,null,null,{"$f":"SUMIF(S$5:S$76,S2,R$5:R$76)","v":0},"C"]
["E120","KG",{"$f":"TODAY()","v":"2019-03-20"},{"$f":"MOD(NOW(),1)","v":"15:44:02.070"},"GLCA",null,null,null,"0001","BE",{"$f":"C3","v":"2019-03-20"},{"$f":"L$2&\"0630\"","v":"20190630"},null,"YE Inventory Adjustment",null,{"$f":"SUM(R5:R76)","v":0},1400030000,"J","D","00CAFR","_CAFR","H","NOT RELEVANT",null,null,"Inventory adjustment - "," Row ",null,null,null,15]
["Bus Area","SSI","File Dt","File Tm","Trans Key","Appr Stat","Process","Appr Grp","Seq #","Doc Typ","Doc Dt","Post Dt","Ref","HeadTxt","Line #","Doc Amt","GL Acct","Line Amt","D/C","Cost","Funct","Fund","Grant","In Order","WBS","Line Text","Tax","EF-Doc#","EF-Line#","Assign#","FisPd"]
["E120","KG",{"$f":"$C$3","v":"2019-03-20"},{"$f":"$D$3","v":"15:44:02.070"},"GLCA",null,null,null,"0001","BE",{"$f":"$K$3","v":"2019-03-20"},{"$f":"$L$3","v":"20190630"},"INV01","YE Inventory Adjustment",1,{"$f":"$P$3","v":0},{"$f":"IF($A5=\"\",\"\",Q$3)","v":1400030000},{"$f":"'Package Response'!K2","v":0},"D",{"$f":"'Package Response'!$C$2&'Inventory JE Prep INV01'!$T$3","v":{"$error":"#N/A"}},{"$f":"'Package Response'!$C$2&'Inventory JE Prep INV01'!$U$3","v":{"$error":"#N/A"}},{"$f":"'Package Response'!J2","v":0},"NOT RELEVANT",null,null,{"$f":"'Package Response'!N2","v":"Inventory Adjustment - Agency Row 1"},null,null,null,null,15]
["E120","KG",{"$f":"$C$3","v":"2019-03-20"},{"$f":"$D$3","v":"15:44:02.070"},"GLCA",null,null,null,"0001","BE",{"$f":"$K$3","v":"2019-03-20"},{"$f":"$L$3","v":"20190630"},"INV01","YE Inventory Adjustment",2,{"$f":"$P$3","v":0},{"$f":"'Package Response'!L2","v":0},{"$f":"R5","v":0},"C",{"$f":"'Package Response'!$C$2&'Inventory JE Prep INV01'!$T$3","v":{"$error":"#N/A"}},{"$f":"'Package Response'!$C$2&'Inventory JE Prep INV01'!$U$3","v":{"$error":"#N/A"}},{"$f":"V5","v":0},"NOT RELEVANT",null,null,{"$f":"'Package Response'!N2","v":"Inventory Adjustment - Agency Row 1"},null,null,null,null,15]
["E120","KG","2019-03-20","15:44:02.070","GLCA",null,null,null,"0001","BE","2019-03-20","20190630","INV01","YE Inventory Adjustment",3,0,{"$f":"IF($A7=\"\",\"\",Q$3)","v":1400030000},{"$f":"'Package Response'!K3","v":0},"D",{"$f":"'Package Response'!$C$2&'Inventory JE Prep INV01'!$T$3","v":{"$error":"#N/A"}},{"$f":"'Package Response'!$C$2&'Inventory JE Prep INV01'!$U$3","v":{"$error":"#N/A"}},{"$f":"'Package Response'!J3","v":0},"NOT RELEVANT",null,null,{"$f":"'Package Response'!N3","v":"Inventory Adjustment - Agency Row 2"},null,null,null,null,15]
["E120","KG","2019-03-20","15:44:02.070","GLCA",null,null,null,"0001","BE","2019-03-20","20190630","INV01","YE Inventory Adjustment",4,0,{"$f":"'Package Response'!L3","v":0},{"$f":"R7","v":0},"C",{"$f":"'Package Response'!$C$2&'Inventory JE Prep INV01'!$T$3","v":{"$error":"#N/A"}},{"$f":"'Package Response'!$C$2&'Inventory JE Prep INV01'!$U$3","v":{"$error":"#N/A"}},{"$f":"V7","v":0},"NOT RELEVANT",null,null,{"$f":"'Package Response'!N3","v":"Inventory Adjustment - Agency Row 2"},null,null,null,null,15]
["E120","KG","2019-03-20","15:44:02.070","GLCA",null,null,null,"0001","BE","2019-03-20","20190630","INV01","YE Inventory Adjustment",5,0,{"$f":"IF($A9=\"\",\"\",Q$3)","v":1400030000},{"$f":"'Package Response'!K4","v":0},"D",{"$f":"'Package Response'!$C$2&'Inventory JE Prep INV01'!$T$3","v":{"$error":"#N/A"}},{"$f":"'Package Response'!$C$2&'Inventory JE Prep INV01'!$U$3","v":{"$error":"#N/A"}},{"$f":"'Package Response'!J4","v":0},"NOT RELEVANT",null,null,{"$f":"'Package Response'!N4","v":"Inventory Adjustment - Agency Row 3"},null,null,null,null,15]
["E120","KG","2019-03-20","15:44:02.070","GLCA",null,null,null,"0001","BE","2019-03-20","20190630","INV01","YE Inventory Adjustment",6,0,{"$f":"'Package Response'!L4","v":0},{"$f":"R9","v":0},"C",{"$f":"'Package Response'!$C$2&'Inventory JE Prep INV01'!$T$3","v":{"$error":"#N/A"}},{"$f":"'Package Response'!$C$2&'Inventory JE Prep INV01'!$U$3","v":{"$error":"#N/A"}},{"$f":"V9","v":0},"NOT RELEVANT",null,null,{"$f":"'Package Response'!N4","v":"Inventory Adjustment - Agency Row 3"},null,null,null,null,15]
["E120","KG","2019-03-20","15:44:02.070","GLCA",null,null,null,"0001","BE","2019-03-20","20190630","INV01","YE Inventory Adjustment",7,0,{"$f":"IF($A11=\"\",\"\",Q$3)","v":1400030000},{"$f":"'Package Response'!K5","v":0},"D",{"$f":"'Package Response'!$C$2&'Inventory JE Prep INV01'!$T$3","v":{"$error":"#N/A"}},{"$f":"'Package Response'!$C$2&'Inventory JE Prep INV01'!$U$3","v":{"$error":"#N/A"}},{"$f":"'Package Response'!J5","v":0},"NOT RELEVANT",null,null,{"$f":"'Package Response'!N5","v":"Inventory Adjustment - Agency Row 4"},null,null,null,null,15]
["E120","KG","2019-03-20","15:44:02.070","GLCA",null,null,null,"0001","BE","2019-03-20","20190630","INV01","YE Inventory Adjustment",8,0,{"$f":"'Package Response'!L5","v":0},{"$f":"R11","v":0},"C",{"$f":"'Package Response'!$C$2&'Inventory JE Prep INV01'!$T$3","v":{"$error":"#N/A"}},{"$f":"'Package Response'!$C$2&'Inventory JE Prep INV01'!$U$3","v":{"$error":"#N/A"}},{"$f":"V11","v":0},"NOT RELEVANT",null,null,{"$f":"'Package Response'!N5","v":"Inventory Adjustment - Agency Row 4"},null,null,null,null,15]
["E120","KG","2019-03-20","15:44:02.070","GLCA",null,null,null,"0001","BE","2019-03-20","20190630","INV01","YE Inventory Adjustment",9,0,{"$f":"IF($A13=\"\",\"\",Q$3)","v":1400030000},{"$f":"'Package Response'!K6","v":0},"D",{"$f":"'Package Response'!$C$2&'Inventory JE Prep INV01'!$T$3","v":{"$error":"#N/A"}},{"$f":"'Package Response'!$C$2&'Inventory JE Prep INV01'!$U$3","v":{"$error":"#N/A"}},{"$f":"'Package Response'!J6","v":0},"NOT RELEVANT",null,null,{"$f":"'Package Response'!N6","v":"Inventory Adjustment - Agency Row 5"},null,null,null,null,15]
["E120","KG","2019-03-20","15:44:02.070","GLCA",null,null,null,"0001","BE","2019-03-20","20190630","INV01","YE Inventory Adjustment",10,0,{"$f":"'Package Response'!L6","v":0},{"$f":"R13","v":0},"C",{"$f":"'Package Response'!$C$2&'Inventory JE Prep INV01'!$T$3","v":{"$error":"#N/A"}},{"$f":"'Package Response'!$C$2&'Inventory JE Prep INV01'!$U$3","v":{"$error":"#N/A"}},{"$f":"V13","v":0},"NOT RELEVANT",null,null,{"$f":"'Package Response'!N6","v":"Inventory Adjustment - Agency Row 5"},null,null,null,null,15]
["E120","KG","2019-03-20","15:44:02.070","GLCA",null,null,null,"0001","BE","2019-03-20","20190630","INV01","YE Inventory Adjustment",11,0,{"$f":"IF($A15=\"\",\"\",Q$3)","v":1400030000},{"$f":"'Package Response'!K7","v":0},"D",{"$f":"'Package Response'!$C$2&'Inventory JE Prep INV01'!$T$3","v":{"$error":"#N/A"}},{"$f":"'Package Response'!$C$2&'Inventory JE Prep INV01'!$U$3","v":{"$error":"#N/A"}},{"$f":"'Package Response'!J7","v":0},"NOT RELEVANT",null,null,{"$f":"'Package Response'!N7","v":"Inventory Adjustment - Agency Row 6"},null,null,null,null,15]
["E120","KG","2019-03-20","15:44:02.070","GLCA",null,null,null,"0001","BE","2019-03-20","20190630","INV01","YE Inventory Adjustment",12,0,{"$f":"'Package Response'!L7","v":0},{"$f":"R15","v":0},"C",{"$f":"'Package Response'!$C$2&'Inventory JE Prep INV01'!$T$3","v":{"$error":"#N/A"}},{"$f":"'Package Response'!$C$2&'Inventory JE Prep INV01'!$U$3","v":{"$error":"#N/A"}},{"$f":"V15","v":0},"NOT RELEVANT",null,null,{"$f":"'Package Response'!N7","v":"Inventory Adjustment - Agency Row 6"},null,null,null,null,15]
["E120","KG","2019-03-20","15:44:02.070","GLCA",null,null,null,"0001","BE","2019-03-20","20190630","INV01","YE Inventory Adjustment",13,0,{"$f":"IF($A17=\"\",\"\",Q$3)","v":1400030000},{"$f":"'Package Response'!K8","v":0},"D",{"$f":"'Package Response'!$C$2&'Inventory JE Prep INV01'!$T$3","v":{"$error":"#N/A"}},{"$f":"'Package Response'!$C$2&'Inventory JE Prep INV01'!$U$3","v":{"$error":"#N/A"}},{"$f":"'Package Response'!J8","v":0},"NOT RELEVANT",null,null,{"$f":"'Package Response'!N8","v":"Inventory Adjustment - Agency Row 7"},null,null,null,null,15]
["E120","KG","2019-03-20","15:44:02.070","GLCA",null,null,null,"0001","BE","2019-03-20","20190630","INV01","YE Inventory Adjustment",14,0,{"$f":"'Package Response'!L8","v":0},{"$f":"R17","v":0},"C",{"$f":"'Package Response'!$C$2&'Inventory JE Prep INV01'!$T$3","v":{"$error":"#N/A"}},{"$f":"'Package Response'!$C$2&'Inventory JE Prep INV01'!$U$3","v":{"$error":"#N/A"}},{"$f":"V17","v":0},"NOT RELEVANT",null,null,{"$f":"'Package Response'!N8","v":"Inventory Adjustment - Agency Row 7"},null,null,null,null,15]
["E120","KG","2019-03-20","15:44:02.070","GLCA",null,null,null,"0001","BE","2019-03-20","20190630","INV01","YE Inventory Adjustment",15,0,{"$f":"IF($A19=\"\",\"\",Q$3)","v":1400030000},{"$f":"'Package Response'!K9","v":0},"D",{"$f":"'Package Response'!$C$2&'Inventory JE Prep INV01'!$T$3","v":{"$error":"#N/A"}},{"$f":"'Package Response'!$C$2&'Inventory JE Prep INV01'!$U$3","v":{"$error":"#N/A"}},{"$f":"'Package Response'!J9","v":0},"NOT RELEVANT",null,null,{"$f":"'Package Response'!N9","v":"Inventory Adjustment - Agency Row 8"},null,null,null,null,15]
["E120","KG","2019-03-20","15:44:02.070","GLCA",null,null,null,"0001","BE","2019-03-20","20190630","INV01","YE Inventory Adjustment",16,0,{"$f":"'Package Response'!L9","v":0},{"$f":"R19","v":0},"C",{"$f":"'Package Response'!$C$2&'Inventory JE Prep INV01'!$T$3","v":{"$error":"#N/A"}},{"$f":"'Package Response'!$C$2&'Inventory JE Prep INV01'!$U$3","v":{"$error":"#N/A"}},{"$f":"V19","v":0},"NOT RELEVANT",null,null,{"$f":"'Package Response'!N9","v":"Inventory Adjustment - Agency Row 8"},null,null,null,null,15]
{"$rows_left_out":64}
{"sheet":"Business Area Lookup","index":7,"n_rows":85,"n_cols":3,"rows_kept":85,"cut":false,"hidden":true,"merged":[]}
[null,"STATE OF SOUTH CAROLINA"]
[null,"REPORTING ENTITY BUSINESS AREAS BY FUNCTION"]
[]
["AGCY  CODE","AGENCY NAME","CAFR Lkup"]
["Agency","Agency Name"]
["A010","LEGISLATIVE DEPARTMENT - THE SENATE","A000"]
["A050","LEGISLATIVE DEPARTMENT - HOUSE OF REPRESENTATIVES","A000"]
["A150","LEGISLATIVE DEPARTMENT - CODIFICATION OF LAWS & LEGISLATIVE COUNCIL","A000"]
["A170","LEGISLATIVE DEPARTMENT - LEGISLATIVE SERVICES AGENCY","A000"]
["A200","LEGISLATIVE DEPARTMENT - LEGISLATIVE AUDIT COUNCIL","A000"]
["A850","EDUCATION OVERSIGHT COMMITTEE","A000"]
["B040","JUDICIAL DEPARTMENT","N000"]
["C050","ADMINISTRATIVE LAW COURT","A000"]
["D050","GOVERNOR'S OFFICE--EXECUTIVE CONTROL OF STATE","A000"]
["D100","STATE LAW ENFORCEMENT DIVISION","N000"]
["D170","GOVERNOR'S OFFICE-- EXECUTIVE POLICY & PROGRAMS","A000"]
["D200","GOVERNOR'S OFFICE--MANSION & GROUNDS","A000"]
["D250","OFFICE OF INSPECTOR GENERAL","A000"]
["D500","DEPARTMENT OF ADMINISTRATION","A000"]
["E040","LIEUTENANT GOVERNOR'S OFFICE","A000"]
{"$rows_left_out":65}