{"text_format":"1","workbook":"xlsx","n_sheets":7,"sheets":["Instructions","Signature Page","3.05.1","Reviewer Checklist","Package Response","JE Prep","Lookup Tables"],"not_rendered":{"charts":0,"images":0,"macros":1,"external_links":1,"defined_names":6,"comments":0,"pivot_tables":0},"unopened":[],"bounds":{"document_bytes":16777216,"sheet_cells":100000,"rows_first":2000,"rows_last":500,"rows_between":2000,"halvings":0,"cell_chars":16384,"cell_head_chars":4096},"cells_cut":0,"cells_raw":0,"read":"whole","date_system":"1900"}

{"sheet":"Instructions","index":0,"n_rows":49,"n_cols":9,"rows_kept":49,"cut":false,"hidden":false,"merged":[[2,0,2,11],[0,0,0,11],[30,1,30,11],[45,7,45,9],[34,7,34,9],[3,0,3,11],[1,0,1,11]]}
["State of South Carolina"]
["Section 3.05, Unearned Revenue Reporting Package"]
["GAAP Year-End Reporting"]
["Fiscal Year 2019"]
[]
[null,"Purpose and Objective:"]
[null,"The accrual reporting (whether modified or full) required by GAAP includes the reporting of "]
[null,"unearned revenue for charges for services and other operational activity."]
[]
[null,"If questions arise that can not be answered by the Reporting Policies and Procedures Manual, please contact"]
[null,"the Financial Reporting Division of the Comptroller General's Office."]
[]
[null,"Key Terms:"]
[null,"Unearned Revenue: A liability representing an amount collected in advance of the earnings process. "]
[]
[null,"Instructions for Completion of the Form(s):"]
[null,"Use the macro button to create as many copies of the form as is required."]
[null,"Enter the information requested by the descriptions of each field."]
[null,"●   Features within the forms to assist in completion include:"]
[null,"►    Drop-down menus are available to assist in the responses to questions on the forms."]
{"$rows_left_out":30}
{"sheet":"Signature Page","index":1,"n_rows":64,"n_cols":7,"rows_kept":64,"cut":false,"hidden":false,"merged":[[0,2,0,6],[1,2,1,6],[2,2,2,6],[3,2,3,6],[25,4,25,5],[21,4,21,5],[23,4,23,5],[19,4,19,5],[5,4,5,5],[6,4,6,5],[9,4,9,5],[11,4,11,5],[13,4,13,5],[15,4,15,5],[17,4,17,5],[53,1,53,5],[55,1,55,5],[57,1,57,5],[59,1,59,5],[61,1,61,5],[63,1,63,5],[54,1,54,5],[56,1,56,5],[58,1,58,5],[60,1,60,5],[62,1,62,5],[52,1,52,5],[43,1,43,5],[45,1,45,5],[47,1,47,5],[51,1,51,5],[49,1,49,5],[50,1,50,5],[31,4,31,5],[35,1,35,5],[27,4,27,5],[29,4,29,5],[41,1,41,5]]}
[null,null,"State of South Carolina"]
[null,null,"Section 3.05, Unearned Revenue Reporting Package"]
[null,null,"Signature Page"]
[null,null,"Fiscal Year 2019"]
[]
[null,null,"Agency",null,{"$f":"IF(C6=\"\",\"\",VLOOKUP($C$6,'Lookup Tables'!$A$1:$B$81,2,FALSE))","v":"Agency Name"}]
[null,null,"Agency",null,"Agency Name"]
[]
[]
[null,null,"Preparer","Signature:",null,null," "]
[]
[null,null,null,"Date:",null,null," "]
[]
[null,null,null,"Name:",null,null," "]
[]
[null,null,null,"Title:",null,null," "]
[]
[null,null,null,"e-mail:",null,null," "]
[]
[null,null,null,"Phone Number:",null,null," "]
{"$rows_left_out":45}
{"sheet":"3.05.1","index":2,"n_rows":54,"n_cols":11,"rows_kept":54,"cut":false,"hidden":false,"merged":[[9,1,9,2],[9,3,9,4],[0,0,0,7],[1,0,1,7],[2,0,2,7],[3,0,3,7],[6,4,6,6]]}
["State of South Carolina"]
["Section 3.05, Unearned Revenue Reporting Package"]
["Unearned Revenue Summary Form"]
["At June 30, 2019"]
[]
[]
[null,"Agency:",{"$f":"'Signature Page'!C6","v":"Agency"},"Agency Name:",{"$f":"VLOOKUP(C7,'Lookup Tables'!A:B,2,FALSE)","v":"Agency Name"}]
[]
[]
[null,"Preparer (Type Name):",null,null,null,"Reviewer (Type Name):"]
[null,null,null,null,null,null,null,null,null,null,"Select…"]
[null,"Recorded in SCEIS?\n(As Unearned Revenue 2400030000 or 2400030001)","Revenue Account \n(If not reported in SCEIS as Unearned/Deferred Revenue)","Fund","Amount","Revenue Type","Description",null,null,null,"Yes"]
[null,null,null,null,null,null,null,null,null,null,"No"]
[null,null,null,null,null,"Select…"]
[]
[]
[null,null,null,null,null,null,null,null,null,null,"Select…"]
[null,null,null,null,null,null,null,null,null,null,"Other Unearned Revenue  "]
[null,null,null,null,null,null,null,null,null,null,"Patient Services"]
[null,null,null,null,null,null,null,null,null,null,"Tuition & Student Services"]
{"$rows_left_out":35}
{"sheet":"Reviewer Checklist","index":3,"n_rows":29,"n_cols":9,"rows_kept":29,"cut":false,"hidden":false,"merged":[[0,0,0,11],[1,0,1,11],[2,0,2,11],[3,0,3,11]]}
["State of South Carolina"]
["Section 3.05, Unearned Revenue Reporting Package"]
["Reviewer Checklist"]
["Fiscal Year 2019"]
[]
[]
[null,"Agency:",{"$f":"'Signature Page'!C6","v":"Agency"},null,null,null,null,null,"Date Last Review Step Was Completed:   "]
[]
[]
["Reviewer's Responses:"]
[]
[{"$f":"COUNT(A$10:A10)+1","v":1},"Is the reviewer of the form(s) someone other than the person who prepared it?"]
[]
[{"$f":"COUNT(A$10:A13)+1","v":2},"Is the contact information (i.e. title, email, and telephone number) for the preparer "]
[null,"and reviewer accurately reported on the signature page?"]
[]
[{"$f":"COUNT(A$10:A14)+1","v":3},"Can all amounts reported on each form be traced to official agency "]
[null,"accounting records?"]
[]
[{"$f":"COUNT(A$10:A17)+1","v":4},"Have all reconciling differences between the accounting records, managerial "]
{"$rows_left_out":10}
{"sheet":"Package Response","index":4,"n_rows":39,"n_cols":12,"rows_kept":39,"cut":false,"hidden":true,"merged":[]}
["Line","Business Area","CAFR BA","Agency Name","Recorded in SCEIS","Revenue Account","Fund ","Amount","Revenue Type","Description","Current SCEIS Balance","GAAP Fund"]
[1,{"$f":"'3.05.1'!$C$7","v":"Agency"},{"$f":"VLOOKUP(B:B,'Lookup Tables'!A:C,3,FALSE)","v":"CAFR Business Area"},{"$f":"VLOOKUP(B:B,'Lookup Tables'!A:C,2,FALSE)","v":"Agency Name"},{"$f":"'3.05.1'!B14","v":0},{"$f":"'3.05.1'!C14","v":0},{"$f":"'3.05.1'!D14","v":0},{"$f":"'3.05.1'!E14","v":0},{"$f":"'3.05.1'!F14","v":"Select…"},{"$f":"'3.05.1'!G14","v":0}]
[2,{"$f":"'3.05.1'!$C$7","v":"Agency"},{"$f":"VLOOKUP(B:B,'Lookup Tables'!A:C,3,FALSE)","v":"CAFR Business Area"},{"$f":"VLOOKUP(B:B,'Lookup Tables'!A:C,2,FALSE)","v":"Agency Name"},{"$f":"'3.05.1'!B15","v":0},{"$f":"'3.05.1'!C15","v":0},{"$f":"'3.05.1'!D15","v":0},{"$f":"'3.05.1'!E15","v":0},{"$f":"'3.05.1'!F15","v":0},{"$f":"'3.05.1'!G15","v":0}]
[3,{"$f":"'3.05.1'!$C$7","v":"Agency"},{"$f":"VLOOKUP(B:B,'Lookup Tables'!A:C,3,FALSE)","v":"CAFR Business Area"},{"$f":"VLOOKUP(B:B,'Lookup Tables'!A:C,2,FALSE)","v":"Agency Name"},{"$f":"'3.05.1'!B16","v":0},{"$f":"'3.05.1'!C16","v":0},{"$f":"'3.05.1'!D16","v":0},{"$f":"'3.05.1'!E16","v":0},{"$f":"'3.05.1'!F16","v":0},{"$f":"'3.05.1'!G16","v":0}]
[4,{"$f":"'3.05.1'!$C$7","v":"Agency"},{"$f":"VLOOKUP(B:B,'Lookup Tables'!A:C,3,FALSE)","v":"CAFR Business Area"},{"$f":"VLOOKUP(B:B,'Lookup Tables'!A:C,2,FALSE)","v":"Agency Name"},{"$f":"'3.05.1'!B17","v":0},{"$f":"'3.05.1'!C17","v":0},{"$f":"'3.05.1'!D17","v":0},{"$f":"'3.05.1'!E17","v":0},{"$f":"'3.05.1'!F17","v":0},{"$f":"'3.05.1'!G17","v":0}]
[5,{"$f":"'3.05.1'!$C$7","v":"Agency"},{"$f":"VLOOKUP(B:B,'Lookup Tables'!A:C,3,FALSE)","v":"CAFR Business Area"},{"$f":"VLOOKUP(B:B,'Lookup Tables'!A:C,2,FALSE)","v":"Agency Name"},{"$f":"'3.05.1'!B18","v":0},{"$f":"'3.05.1'!C18","v":0},{"$f":"'3.05.1'!D18","v":0},{"$f":"'3.05.1'!E18","v":0},{"$f":"'3.05.1'!F18","v":0},{"$f":"'3.05.1'!G18","v":0}]
[6,{"$f":"'3.05.1'!$C$7","v":"Agency"},{"$f":"VLOOKUP(B:B,'Lookup Tables'!A:C,3,FALSE)","v":"CAFR Business Area"},{"$f":"VLOOKUP(B:B,'Lookup Tables'!A:C,2,FALSE)","v":"Agency Name"},{"$f":"'3.05.1'!B19","v":0},{"$f":"'3.05.1'!C19","v":0},{"$f":"'3.05.1'!D19","v":0},{"$f":"'3.05.1'!E19","v":0},{"$f":"'3.05.1'!F19","v":0},{"$f":"'3.05.1'!G19","v":0}]
[7,{"$f":"'3.05.1'!$C$7","v":"Agency"},{"$f":"VLOOKUP(B:B,'Lookup Tables'!A:C,3,FALSE)","v":"CAFR Business Area"},{"$f":"VLOOKUP(B:B,'Lookup Tables'!A:C,2,FALSE)","v":"Agency Name"},{"$f":"'3.05.1'!B20","v":0},{"$f":"'3.05.1'!C20","v":0},{"$f":"'3.05.1'!D20","v":0},{"$f":"'3.05.1'!E20","v":0},{"$f":"'3.05.1'!F20","v":0},{"$f":"'3.05.1'!G20","v":0}]
[8,{"$f":"'3.05.1'!$C$7","v":"Agency"},{"$f":"VLOOKUP(B:B,'Lookup Tables'!A:C,3,FALSE)","v":"CAFR Business Area"},{"$f":"VLOOKUP(B:B,'Lookup Tables'!A:C,2,FALSE)","v":"Agency Name"},{"$f":"'3.05.1'!B21","v":0},{"$f":"'3.05.1'!C21","v":0},{"$f":"'3.05.1'!D21","v":0},{"$f":"'3.05.1'!E21","v":0},{"$f":"'3.05.1'!F21","v":0},{"$f":"'3.05.1'!G21","v":0}]
[9,{"$f":"'3.05.1'!$C$7","v":"Agency"},{"$f":"VLOOKUP(B:B,'Lookup Tables'!A:C,3,FALSE)","v":"CAFR Business Area"},{"$f":"VLOOKUP(B:B,'Lookup Tables'!A:C,2,FALSE)","v":"Agency Name"},{"$f":"'3.05.1'!B22","v":0},{"$f":"'3.05.1'!C22","v":0},{"$f":"'3.05.1'!D22","v":0},{"$f":"'3.05.1'!E22","v":0},{"$f":"'3.05.1'!F22","v":0},{"$f":"'3.05.1'!G22","v":0}]
[10,{"$f":"'3.05.1'!$C$7","v":"Agency"},{"$f":"VLOOKUP(B:B,'Lookup Tables'!A:C,3,FALSE)","v":"CAFR Business Area"},{"$f":"VLOOKUP(B:B,'Lookup Tables'!A:C,2,FALSE)","v":"Agency Name"},{"$f":"'3.05.1'!B23","v":0},{"$f":"'3.05.1'!C23","v":0},{"$f":"'3.05.1'!D23","v":0},{"$f":"'3.05.1'!E23","v":0},{"$f":"'3.05.1'!F23","v":0},{"$f":"'3.05.1'!G23","v":0}]
[11,{"$f":"'3.05.1'!$C$7","v":"Agency"},{"$f":"VLOOKUP(B:B,'Lookup Tables'!A:C,3,FALSE)","v":"CAFR Business Area"},{"$f":"VLOOKUP(B:B,'Lookup Tables'!A:C,2,FALSE)","v":"Agency Name"},{"$f":"'3.05.1'!B24","v":0},{"$f":"'3.05.1'!C24","v":0},{"$f":"'3.05.1'!D24","v":0},{"$f":"'3.05.1'!E24","v":0},{"$f":"'3.05.1'!F24","v":0},{"$f":"'3.05.1'!G24","v":0}]
[12,{"$f":"'3.05.1'!$C$7","v":"Agency"},{"$f":"VLOOKUP(B:B,'Lookup Tables'!A:C,3,FALSE)","v":"CAFR Business Area"},{"$f":"VLOOKUP(B:B,'Lookup Tables'!A:C,2,FALSE)","v":"Agency Name"},{"$f":"'3.05.1'!B25","v":0},{"$f":"'3.05.1'!C25","v":0},{"$f":"'3.05.1'!D25","v":0},{"$f":"'3.05.1'!E25","v":0},{"$f":"'3.05.1'!F25","v":0},{"$f":"'3.05.1'!G25","v":0}]
[13,{"$f":"'3.05.1'!$C$7","v":"Agency"},{"$f":"VLOOKUP(B:B,'Lookup Tables'!A:C,3,FALSE)","v":"CAFR Business Area"},{"$f":"VLOOKUP(B:B,'Lookup Tables'!A:C,2,FALSE)","v":"Agency Name"},{"$f":"'3.05.1'!B26","v":0},{"$f":"'3.05.1'!C26","v":0},{"$f":"'3.05.1'!D26","v":0},{"$f":"'3.05.1'!E26","v":0},{"$f":"'3.05.1'!F26","v":0},{"$f":"'3.05.1'!G26","v":0}]
[14,{"$f":"'3.05.1'!$C$7","v":"Agency"},{"$f":"VLOOKUP(B:B,'Lookup Tables'!A:C,3,FALSE)","v":"CAFR Business Area"},{"$f":"VLOOKUP(B:B,'Lookup Tables'!A:C,2,FALSE)","v":"Agency Name"},{"$f":"'3.05.1'!B27","v":0},{"$f":"'3.05.1'!C27","v":0},{"$f":"'3.05.1'!D27","v":0},{"$f":"'3.05.1'!E27","v":0},{"$f":"'3.05.1'!F27","v":0},{"$f":"'3.05.1'!G27","v":0}]
[15,{"$f":"'3.05.1'!$C$7","v":"Agency"},{"$f":"VLOOKUP(B:B,'Lookup Tables'!A:C,3,FALSE)","v":"CAFR Business Area"},{"$f":"VLOOKUP(B:B,'Lookup Tables'!A:C,2,FALSE)","v":"Agency Name"},{"$f":"'3.05.1'!B28","v":0},{"$f":"'3.05.1'!C28","v":0},{"$f":"'3.05.1'!D28","v":0},{"$f":"'3.05.1'!E28","v":0},{"$f":"'3.05.1'!F28","v":0},{"$f":"'3.05.1'!G28","v":0}]
[16,{"$f":"'3.05.1'!$C$7","v":"Agency"},{"$f":"VLOOKUP(B:B,'Lookup Tables'!A:C,3,FALSE)","v":"CAFR Business Area"},{"$f":"VLOOKUP(B:B,'Lookup Tables'!A:C,2,FALSE)","v":"Agency Name"},{"$f":"'3.05.1'!B29","v":0},{"$f":"'3.05.1'!C29","v":0},{"$f":"'3.05.1'!D29","v":0},{"$f":"'3.05.1'!E29","v":0},{"$f":"'3.05.1'!F29","v":0},{"$f":"'3.05.1'!G29","v":0}]
[17,{"$f":"'3.05.1'!$C$7","v":"Agency"},{"$f":"VLOOKUP(B:B,'Lookup Tables'!A:C,3,FALSE)","v":"CAFR Business Area"},{"$f":"VLOOKUP(B:B,'Lookup Tables'!A:C,2,FALSE)","v":"Agency Name"},{"$f":"'3.05.1'!B30","v":0},{"$f":"'3.05.1'!C30","v":0},{"$f":"'3.05.1'!D30","v":0},{"$f":"'3.05.1'!E30","v":0},{"$f":"'3.05.1'!F30","v":0},{"$f":"'3.05.1'!G30","v":0}]
[18,{"$f":"'3.05.1'!$C$7","v":"Agency"},{"$f":"VLOOKUP(B:B,'Lookup Tables'!A:C,3,FALSE)","v":"CAFR Business Area"},{"$f":"VLOOKUP(B:B,'Lookup Tables'!A:C,2,FALSE)","v":"Agency Name"},{"$f":"'3.05.1'!B31","v":0},{"$f":"'3.05.1'!C31","v":0},{"$f":"'3.05.1'!D31","v":0},{"$f":"'3.05.1'!E31","v":0},{"$f":"'3.05.1'!F31","v":0},{"$f":"'3.05.1'!G31","v":0}]
[19,{"$f":"'3.05.1'!$C$7","v":"Agency"},{"$f":"VLOOKUP(B:B,'Lookup Tables'!A:C,3,FALSE)","v":"CAFR Business Area"},{"$f":"VLOOKUP(B:B,'Lookup Tables'!A:C,2,FALSE)","v":"Agency Name"},{"$f":"'3.05.1'!B32","v":0},{"$f":"'3.05.1'!C32","v":0},{"$f":"'3.05.1'!D32","v":0},{"$f":"'3.05.1'!E32","v":0},{"$f":"'3.05.1'!F32","v":0},{"$f":"'3.05.1'!G32","v":0}]
{"$rows_left_out":20}
{"sheet":"JE Prep","index":5,"n_rows":43,"n_cols":31,"rows_kept":43,"cut":false,"hidden":true,"merged":[]}
[null,null,null,null,null,null,null,null,null,null,null,null,null,null,null,null,null,{"$f":"SUMIF($S$4:$S$49,S1,$R$4:$R$49)","v":0},"D",{"$f":"R1-R2","v":0}]
[null,null,null,null,null,null,null,null,null,null,null,null,null,null,null,null,null,{"$f":"SUMIF($S$4:$S$49,S2,$R$4:$R$49)","v":0},"C"]
["Bus Area","SSI","File Dt","File Tm","Trans Key","Appr Stat","Process","Appr Grp","Seq #","Doc Typ","Doc Dt","Post Dt","Ref","HeadTxt","Line #","Doc Amt","GL Acct","Line Amt","D/C","Cost","Funct","Fund","Grant","In Order","WBS","Line Text","Tax","EF-Doc#","EF-Line#","Assign#","FisPd"]
["E120","KG",20190905,"15:20:13","GLCA",null,null,null,"0001","BE",20190905,20190630,"MRV05","YE Unearned Revenue Adjustment",1,{"$f":"SUM($R$4:$R$49)","v":0},2400030000,{"$f":"'Package Response'!H2","v":0},"C",{"$f":"'Package Response'!C2&\"00CAFR\"","v":"CAFR Business Area00CAFR"},{"$f":"'Package Response'!C2&\"_CAFR\"","v":"CAFR Business Area_CAFR"},{"$f":"'Package Response'!G2","v":0},"NOT RELEVANT",null,null,{"$f":"\"Unearned Rev \"&'Package Response'!B2&\" Line \"&'Package Response'!A2","v":"Unearned Rev Agency Line 1"},null,null,null,null,15]
["E120","KG",20190905,"15:20:13","GLCA",null,null,null,"0001","BE",20190905,20190630,"MRV05","YE Unearned Revenue Adjustment",2,{"$f":"SUM($R$4:$R$56)","v":0},{"$f":"'Package Response'!F2","v":0},{"$f":"R4","v":0},"D",{"$f":"T4","v":"CAFR Business Area00CAFR"},{"$f":"U4","v":"CAFR Business Area_CAFR"},{"$f":"V4","v":0},"NOT RELEVANT",null,null,{"$f":"Z4","v":"Unearned Rev Agency Line 1"},null,null,null,null,15]
["E120","KG",20190905,"15:20:13","GLCA",null,null,null,"0001","BE",20190905,20190630,"MRV05","YE Unearned Revenue Adjustment",3,{"$f":"SUM($R$4:$R$56)","v":0},2400030000,{"$f":"'Package Response'!H3","v":0},"C",{"$f":"'Package Response'!C3&\"00CAFR\"","v":"CAFR Business Area00CAFR"},{"$f":"'Package Response'!C3&\"_CAFR\"","v":"CAFR Business Area_CAFR"},{"$f":"'Package Response'!G3","v":0},"NOT RELEVANT",null,null,{"$f":"\"Unearned Rev \"&'Package Response'!B3&\" Line \"&'Package Response'!A3","v":"Unearned Rev Agency Line 2"},null,null,null,null,15]
["E120","KG",20190905,"15:20:13","GLCA",null,null,null,"0001","BE",20190905,20190630,"MRV05","YE Unearned Revenue Adjustment",4,0,{"$f":"'Package Response'!F3","v":0},{"$f":"R6","v":0},"D",{"$f":"T6","v":"CAFR Business Area00CAFR"},{"$f":"U6","v":"CAFR Business Area_CAFR"},{"$f":"V6","v":0},"NOT RELEVANT",null,null,{"$f":"Z6","v":"Unearned Rev Agency Line 2"},null,null,null,null,15]
["E120","KG",20190905,"15:20:13","GLCA",null,null,null,"0001","BE",20190905,20190630,"MRV05","YE Unearned Revenue Adjustment",5,0,2400030000,{"$f":"'Package Response'!H4","v":0},"C",{"$f":"'Package Response'!C4&\"00CAFR\"","v":"CAFR Business Area00CAFR"},{"$f":"'Package Response'!C4&\"_CAFR\"","v":"CAFR Business Area_CAFR"},{"$f":"'Package Response'!G4","v":0},"NOT RELEVANT",null,null,{"$f":"\"Unearned Rev \"&'Package Response'!B4&\" Line \"&'Package Response'!A4","v":"Unearned Rev Agency Line 3"},null,null,null,null,15]
["E120","KG",20190905,"15:20:13","GLCA",null,null,null,"0001","BE",20190905,20190630,"MRV05","YE Unearned Revenue Adjustment",6,0,{"$f":"'Package Response'!F4","v":0},{"$f":"R8","v":0},"D",{"$f":"T8","v":"CAFR Business Area00CAFR"},{"$f":"U8","v":"CAFR Business Area_CAFR"},{"$f":"V8","v":0},"NOT RELEVANT",null,null,{"$f":"Z8","v":"Unearned Rev Agency Line 3"},null,null,null,null,15]
["E120","KG",20190905,"15:20:13","GLCA",null,null,null,"0001","BE",20190905,20190630,"MRV05","YE Unearned Revenue Adjustment",7,0,2400030000,{"$f":"'Package Response'!H5","v":0},"C",{"$f":"'Package Response'!C5&\"00CAFR\"","v":"CAFR Business Area00CAFR"},{"$f":"'Package Response'!C5&\"_CAFR\"","v":"CAFR Business Area_CAFR"},{"$f":"'Package Response'!G5","v":0},"NOT RELEVANT",null,null,{"$f":"\"Unearned Rev \"&'Package Response'!B5&\" Line \"&'Package Response'!A5","v":"Unearned Rev Agency Line 4"},null,null,null,null,15]
["E120","KG",20190905,"15:20:13","GLCA",null,null,null,"0001","BE",20190905,20190630,"MRV05","YE Unearned Revenue Adjustment",8,0,{"$f":"'Package Response'!F5","v":0},{"$f":"R10","v":0},"D",{"$f":"T10","v":"CAFR Business Area00CAFR"},{"$f":"U10","v":"CAFR Business Area_CAFR"},{"$f":"V10","v":0},"NOT RELEVANT",null,null,{"$f":"Z10","v":"Unearned Rev Agency Line 4"},null,null,null,null,15]
["E120","KG",20190905,"15:20:13","GLCA",null,null,null,"0001","BE",20190905,20190630,"MRV05","YE Unearned Revenue Adjustment",9,0,2400030000,{"$f":"'Package Response'!H6","v":0},"C",{"$f":"'Package Response'!C6&\"00CAFR\"","v":"CAFR Business Area00CAFR"},{"$f":"'Package Response'!C6&\"_CAFR\"","v":"CAFR Business Area_CAFR"},{"$f":"'Package Response'!G6","v":0},"NOT RELEVANT",null,null,{"$f":"\"Unearned Rev \"&'Package Response'!B6&\" Line \"&'Package Response'!A6","v":"Unearned Rev Agency Line 5"},null,null,null,null,15]
["E120","KG",20190905,"15:20:13","GLCA",null,null,null,"0001","BE",20190905,20190630,"MRV05","YE Unearned Revenue Adjustment",10,0,{"$f":"'Package Response'!F6","v":0},{"$f":"R12","v":0},"D",{"$f":"T12","v":"CAFR Business Area00CAFR"},{"$f":"U12","v":"CAFR Business Area_CAFR"},{"$f":"V12","v":0},"NOT RELEVANT",null,null,{"$f":"Z12","v":"Unearned Rev Agency Line 5"},null,null,null,null,15]
["E120","KG",20190905,"15:20:13","GLCA",null,null,null,"0001","BE",20190905,20190630,"MRV05","YE Unearned Revenue Adjustment",11,0,2400030000,{"$f":"'Package Response'!H7","v":0},"C",{"$f":"'Package Response'!C7&\"00CAFR\"","v":"CAFR Business Area00CAFR"},{"$f":"'Package Response'!C7&\"_CAFR\"","v":"CAFR Business Area_CAFR"},{"$f":"'Package Response'!G7","v":0},"NOT RELEVANT",null,null,{"$f":"\"Unearned Rev \"&'Package Response'!B7&\" Line \"&'Package Response'!A7","v":"Unearned Rev Agency Line 6"},null,null,null,null,15]
["E120","KG",20190905,"15:20:13","GLCA",null,null,null,"0001","BE",20190905,20190630,"MRV05","YE Unearned Revenue Adjustment",12,0,{"$f":"'Package Response'!F7","v":0},{"$f":"R14","v":0},"D",{"$f":"T14","v":"CAFR Business Area00CAFR"},{"$f":"U14","v":"CAFR Business Area_CAFR"},{"$f":"V14","v":0},"NOT RELEVANT",null,null,{"$f":"Z14","v":"Unearned Rev Agency Line 6"},null,null,null,null,15]
["E120","KG",20190905,"15:20:13","GLCA",null,null,null,"0001","BE",20190905,20190630,"MRV05","YE Unearned Revenue Adjustment",13,0,2400030000,{"$f":"'Package Response'!H8","v":0},"C",{"$f":"'Package Response'!C8&\"00CAFR\"","v":"CAFR Business Area00CAFR"},{"$f":"'Package Response'!C8&\"_CAFR\"","v":"CAFR Business Area_CAFR"},{"$f":"'Package Response'!G8","v":0},"NOT RELEVANT",null,null,{"$f":"\"Unearned Rev \"&'Package Response'!B8&\" Line \"&'Package Response'!A8","v":"Unearned Rev Agency Line 7"},null,null,null,null,15]
["E120","KG",20190905,"15:20:13","GLCA",null,null,null,"0001","BE",20190905,20190630,"MRV05","YE Unearned Revenue Adjustment",14,0,{"$f":"'Package Response'!F8","v":0},{"$f":"R16","v":0},"D",{"$f":"T16","v":"CAFR Business Area00CAFR"},{"$f":"U16","v":"CAFR Business Area_CAFR"},{"$f":"V16","v":0},"NOT RELEVANT",null,null,{"$f":"Z16","v":"Unearned Rev Agency Line 7"},null,null,null,null,15]
["E120","KG",20190905,"15:20:13","GLCA",null,null,null,"0001","BE",20190905,20190630,"MRV05","YE Unearned Revenue Adjustment",15,0,2400030000,{"$f":"'Package Response'!H9","v":0},"C",{"$f":"'Package Response'!C9&\"00CAFR\"","v":"CAFR Business Area00CAFR"},{"$f":"'Package Response'!C9&\"_CAFR\"","v":"CAFR Business Area_CAFR"},{"$f":"'Package Response'!G9","v":0},"NOT RELEVANT",null,null,{"$f":"\"Unearned Rev \"&'Package Response'!B9&\" Line \"&'Package Response'!A9","v":"Unearned Rev Agency Line 8"},null,null,null,null,15]
["E120","KG",20190905,"15:20:13","GLCA",null,null,null,"0001","BE",20190905,20190630,"MRV05","YE Unearned Revenue Adjustment",16,0,{"$f":"'Package Response'!F9","v":0},{"$f":"R18","v":0},"D",{"$f":"T18","v":"CAFR Business Area00CAFR"},{"$f":"U18","v":"CAFR Business Area_CAFR"},{"$f":"V18","v":0},"NOT RELEVANT",null,null,{"$f":"Z18","v":"Unearned Rev Agency Line 8"},null,null,null,null,15]
["E120","KG",20190905,"15:20:13","GLCA",null,null,null,"0001","BE",20190905,20190630,"MRV05","YE Unearned Revenue Adjustment",17,0,2400030000,{"$f":"'Package Response'!H10","v":0},"C",{"$f":"'Package Response'!C10&\"00CAFR\"","v":"CAFR Business Area00CAFR"},{"$f":"'Package Response'!C10&\"_CAFR\"","v":"CAFR Business Area_CAFR"},{"$f":"'Package Response'!G10","v":0},"NOT RELEVANT",null,null,{"$f":"\"Unearned Rev \"&'Package Response'!B10&\" Line \"&'Package Response'!A10","v":"Unearned Rev Agency Line 9"},null,null,null,null,15]
{"$rows_left_out":24}
{"sheet":"Lookup Tables","index":6,"n_rows":81,"n_cols":9,"rows_kept":81,"cut":false,"hidden":true,"merged":[]}
["Agency","Agency Name","CAFR Business Area",null,"CAFR Business Area","Expense Account",null,"Payable Account","Account Name"]
["A010","Legislative Department - The Senate","A000",null,"A000",5510101010,null,2010000000,"Accounts Payable"]
["A050","Legislative Department - House of Representatives","A000",null,"H000",5510201020,null,2010150000,"Pay-Aid Indiv/Fam"]
["A150","Legislative Department - Codification of Laws & Legislative Council","A000",null,"J000",5510251025,null,2010010000,"Sales Tax Payable"]
["A170","Legislative Department - Legislative Services Agency","A000",null,"L000",5510351035,null,2010030000,"Accrued Accounts Payable"]
["A200","Legislative Department - Legislative Audit Council","A000",null,"N000",5510401040,null,2010120000,"Intergov Payable"]
["A850","Education Oversight Committee","A000",null,"P000",5510501050,null,2010070000,"Retainage Payable"]
["B040","Judicial Department","N000",null,"U000",5510601060,null,2050030000,"Retainage Non-Current"]
["C050","Administrative Law Court","A000",null,null,null,null,2400130000,"Other Current Liabilities"]
["D050","Governor's office--Executive Control of State","A000"]
["D100","State Law Enforcement Division","N000"]
["D170","Governor's office-- Executive Policy & Programs","A000"]
["D200","Governor's office--Mansion & Grounds","A000"]
["D250","office of Inspector General","A000"]
["D500","Department of Administration","A000"]
["E040","Lieutenant Governor's office","A000"]
["E080","Secretary of State's office","A000"]
["E120","Comptroller General's office","A000"]
["E160","State Treasurer's office                                                                       ","A000"]
["E200","Attorney General's office","A000"]
{"$rows_left_out":61}