{"text_format":"1","workbook":"xlsx","n_sheets":7,"sheets":["Instructions","Signature 1","3.03.1","3.03.2","3.03.3","3.03.4","Summary"],"not_rendered":{"charts":0,"images":0,"macros":0,"external_links":0,"defined_names":9,"comments":0,"pivot_tables":0},"unopened":[],"bounds":{"document_bytes":16777216,"sheet_cells":100000,"rows_first":2000,"rows_last":500,"rows_between":2000,"halvings":0,"cell_chars":16384,"cell_head_chars":4096},"cells_cut":0,"cells_raw":0,"read":"whole","date_system":"1900"}

{"sheet":"Instructions","index":0,"n_rows":143,"n_cols":12,"rows_kept":143,"cut":false,"hidden":false,"merged":[[142,1,142,11],[53,1,53,13]]}
["STATE OF SOUTH CAROLINA"]
["YEAR-END REPORTING PROCEDURES MANUAL"]
["SECTION 3.03, GRANTS AND CONTRIBUTION REVENUES REPORTING PACKAGE"]
[]
[]
[null,"PURPOSE and OBJECTIVE:"]
[null,"Accurate reporting in accordance with GAAP requires the analysis and recognition of receivables and"]
[null,"deferred revenue in connection with grant awards and contributions.  The reporting package aids in"]
[null,"the identification and reporting of accrual amounts at year-end."]
[]
[null,"Grant information provided in this reporting package should be reported only as the end recipient "]
[null,"in the State's Reporting Entity.  Agency's which pass-through to other agencies or within its agency "]
[null,"should not report pass-through activity within the State's Reporting Entity."]
[null,"Note: internal pass through funds should be zero or have minimal balances at 6/30."]
[null,"If you have substantial balances in funds relating to internal pass through activity, these"]
[null,"should be reported and an explanation as to when the balance will clear and how long the"]
[null,"balance has existed. Substantial is defined as 10% of grant award or more than $500,000."]
[null,"Pass through activity to entities outside of the State's Reporting Entity should be included."]
[]
[null,"Please refer to the Reporting Policies and Procedures Manual for activity which qualifies as grant and"]
{"$rows_left_out":124}
{"sheet":"Signature 1","index":1,"n_rows":137,"n_cols":6,"rows_kept":137,"cut":false,"hidden":false,"merged":[[136,1,136,5],[125,1,125,5],[127,1,127,5],[129,1,129,5],[131,1,131,5],[133,1,133,5]]}
[null,null,"3.03 Grants and Contributions Revenue Packet"]
[]
[]
[null,null,"CAFR Reporting Period:",null,2019]
[null,null,"Agency Number:",null,null," "]
[null,null,"Agency Name",null,{"$f":"IF(ISERROR(VLOOKUP(AgencyCode,C32:D110,2,FALSE))=TRUE,\"\",VLOOKUP(AgencyCode,C32:D110,2,FALSE))","v":""}]
[]
[]
[]
[]
[]
[null,null,"Preparer","Date:",null," "]
[null,null,null,"Name:",null," "]
[null,null,null,"Title:",null," "]
[null,null,null,"e-mail:",null," "]
[null,null,null,"Phone Number:",null," "]
[null,null,null,"Signature:",null," "]
[]
[null,null,"Reviewer","Date:",null," "]
[null,null,null,"Name:",null," "]
{"$rows_left_out":118}
{"sheet":"3.03.1","index":2,"n_rows":409,"n_cols":15,"rows_kept":409,"cut":false,"hidden":false,"merged":[[160,11,160,12],[161,11,161,12],[162,11,162,12],[163,11,163,12],[164,11,164,12],[165,11,165,12],[166,11,166,12],[167,11,167,12],[151,11,151,12],[152,11,152,12],[153,11,153,12],[154,11,154,12],[155,11,155,12],[156,11,156,12],[157,11,157,12],[158,11,158,12],[159,11,159,12],[142,11,142,12],[143,11,143,12],[144,11,144,12],[145,11,145,12],[146,11,146,12],[147,11,147,12],[148,11,148,12],[149,11,149,12],[150,11,150,12],[133,11,133,12],[134,11,134,12],[135,11,135,12],[136,11,136,12],[137,11,137,12],[138,11,138,12],[139,11,139,12],[140,11,140,12],[141,11,141,12],[124,11,124,12],[125,11,125,12],[126,11,126,12],[127,11,127,12],[128,11,128,12],[129,11,129,12],[130,11,130,12],[131,11,131,12],[132,11,132,12],[115,11,115,12],[116,11,116,12],[117,11,117,12],[118,11,118,12],[119,11,119,12],[120,11,120,12],[121,11,121,12],[122,11,122,12],[123,11,123,12],[106,11,106,12],[107,11,107,12],[108,11,108,12],[109,11,109,12],[110,11,110,12],[111,11,111,12],[112,11,112,12],[113,11,113,12],[114,11,114,12],[97,11,97,12],[98,11,98,12],[99,11,99,12],[100,11,100,12],[101,11,101,12],[102,11,102,12],[103,11,103,12],[104,11,104,12],[105,11,105,12],[88,11,88,12],[89,11,89,12],[90,11,90,12],[91,11,91,12],[92,11,92,12],[93,11,93,12],[94,11,94,12],[95,11,95,12],[96,11,96,12],[79,11,79,12],[80,11,80,12],[81,11,81,12],[82,11,82,12],[83,11,83,12],[84,11,84,12],[85,11,85,12],[86,11,86,12],[87,11,87,12],[70,11,70,12],[71,11,71,12],[72,11,72,12],[73,11,73,12],[74,11,74,12],[75,11,75,12],[76,11,76,12],[77,11,77,12],[78,11,78,12],[61,11,61,12],[62,11,62,12],[63,11,63,12],[64,11,64,12],[65,11,65,12],[66,11,66,12],[67,11,67,12],[68,11,68,12],[69,11,69,12],[52,11,52,12],[53,11,53,12],[54,11,54,12],[55,11,55,12],[56,11,56,12],[57,11,57,12],[58,11,58,12],[59,11,59,12],[60,11,60,12],[43,11,43,12],[44,11,44,12],[45,11,45,12],[46,11,46,12],[47,11,47,12],[48,11,48,12],[49,11,49,12],[50,11,50,12],[51,11,51,12],[34,11,34,12],[35,11,35,12],[36,11,36,12],[37,11,37,12],[38,11,38,12],[39,11,39,12],[40,11,40,12],[41,11,41,12],[42,11,42,12],[27,11,27,12],[28,11,28,12],[29,11,29,12],[30,11,30,12],[31,11,31,12],[32,11,32,12],[33,11,33,12],[18,11,18,12],[19,11,19,12],[20,11,20,12],[21,11,21,12],[22,11,22,12],[23,11,23,12],[24,11,24,12],[25,11,25,12],[26,11,26,12],[393,11,393,12],[408,11,408,12],[402,11,402,12],[405,1,422,7],[275,11,275,12],[268,11,268,12],[269,11,269,12],[270,11,270,12],[271,11,271,12],[280,11,280,12],[281,11,281,12],[276,11,276,12],[277,11,277,12],[278,11,278,12],[342,11,342,12],[343,11,343,12],[340,11,340,12],[332,11,332,12],[339,11,339,12],[274,11,274,12],[333,11,333,12],[334,11,334,12],[335,11,335,12],[336,11,336,12],[6,4,6,13],[338,11,338,12],[320,11,320,12],[321,11,321,12],[325,11,325,12],[326,11,326,12],[327,11,327,12],[328,11,328,12],[329,11,329,12],[330,11,330,12],[331,11,331,12],[315,11,315,12],[316,11,316,12],[317,11,317,12],[13,6,16,6],[319,11,319,12],[236,11,236,12],[322,11,322,12],[323,11,323,12],[324,11,324,12],[229,11,229,12],[230,11,230,12],[337,11,337,12],[231,11,231,12],[12,16,394,16],[397,16,408,16],[13,11,13,12],[14,11,14,12],[15,11,15,12],[389,11,389,12],[390,11,390,12],[391,11,391,12],[392,11,392,12],[394,11,394,12],[398,11,398,12],[395,11,395,12],[396,11,396,12],[397,11,397,12],[16,11,16,14],[403,11,403,12],[399,11,399,12],[400,11,400,12],[401,11,401,12],[374,11,374,12],[247,11,247,12],[248,11,248,12],[249,11,249,12],[341,11,341,12],[254,11,254,12],[255,11,255,12],[272,11,272,12],[256,11,256,12],[257,11,257,12],[258,11,258,12],[259,11,259,12],[260,11,260,12],[261,11,261,12],[262,11,262,12],[263,11,263,12],[264,11,264,12],[265,11,265,12],[266,11,266,12],[267,11,267,12],[9,2,9,7],[9,10,9,15],[279,11,279,12],[282,11,282,12],[283,11,283,12],[284,11,284,12],[251,11,251,12],[252,11,252,12],[253,11,253,12],[273,11,273,12],[221,11,221,12],[222,11,222,12],[226,11,226,12],[227,11,227,12],[228,11,228,12],[17,11,17,12],[168,11,168,12],[169,11,169,12],[170,11,170,12],[171,11,171,12],[172,11,172,12],[173,11,173,12],[174,11,174,12],[175,11,175,12],[375,11,375,12],[376,11,376,12],[377,11,377,12],[378,11,378,12],[379,11,379,12],[380,11,380,12],[381,11,381,12],[382,11,382,12],[383,11,383,12],[384,11,384,12],[385,11,385,12],[386,11,386,12],[387,11,387,12],[388,11,388,12],[344,11,344,12],[345,11,345,12],[346,11,346,12],[347,11,347,12],[348,11,348,12],[349,11,349,12],[350,11,350,12],[351,11,351,12],[352,11,352,12],[353,11,353,12],[354,11,354,12],[355,11,355,12],[356,11,356,12],[357,11,357,12],[358,11,358,12],[359,11,359,12],[360,11,360,12],[361,11,361,12],[362,11,362,12],[363,11,363,12],[364,11,364,12],[365,11,365,12],[366,11,366,12],[367,11,367,12],[368,11,368,12],[369,11,369,12],[370,11,370,12],[371,11,371,12],[372,11,372,12],[373,11,373,12],[285,11,285,12],[286,11,286,12],[287,11,287,12],[288,11,288,12],[289,11,289,12],[290,11,290,12],[291,11,291,12],[292,11,292,12],[293,11,293,12],[294,11,294,12],[295,11,295,12],[296,11,296,12],[297,11,297,12],[298,11,298,12],[299,11,299,12],[300,11,300,12],[301,11,301,12],[302,11,302,12],[303,11,303,12],[304,11,304,12],[305,11,305,12],[306,11,306,12],[307,11,307,12],[308,11,308,12],[309,11,309,12],[310,11,310,12],[311,11,311,12],[312,11,312,12],[313,11,313,12],[314,11,314,12],[318,11,318,12],[176,11,176,12],[177,11,177,12],[178,11,178,12],[179,11,179,12],[180,11,180,12],[181,11,181,12],[182,11,182,12],[183,11,183,12],[184,11,184,12],[185,11,185,12],[186,11,186,12],[187,11,187,12],[188,11,188,12],[189,11,189,12],[190,11,190,12],[191,11,191,12],[192,11,192,12],[193,11,193,12],[194,11,194,12],[195,11,195,12],[196,11,196,12],[197,11,197,12],[198,11,198,12],[199,11,199,12],[200,11,200,12],[201,11,201,12],[202,11,202,12],[203,11,203,12],[204,11,204,12],[205,11,205,12],[206,11,206,12],[207,11,207,12],[208,11,208,12],[209,11,209,12],[210,11,210,12],[211,11,211,12],[212,11,212,12],[213,11,213,12],[214,11,214,12],[215,11,215,12],[216,11,216,12],[217,11,217,12],[218,11,218,12],[219,11,219,12],[220,11,220,12],[223,11,223,12],[224,11,224,12],[225,11,225,12],[232,11,232,12],[233,11,233,12],[234,11,234,12],[235,11,235,12],[237,11,237,12],[238,11,238,12],[239,11,239,12],[240,11,240,12],[241,11,241,12],[242,11,242,12],[243,11,243,12],[244,11,244,12],[245,11,245,12],[246,11,246,12],[250,11,250,12]]}
[]
["STATE OF SOUTH CAROLINA"]
["GRANTS ACTIVITY FORM"]
[null,null,null,null,null,null,null,null,"AT JUNE 30,",2019]
[]
[]
[null,"Agency:",{"$f":"'Signature 1'!E5","v":0},null,{"$f":"'Signature 1'!E6","v":""}]
[null,null,"Business Area","Name"]
[]
[null,"Preparer:",null,null,null,null,null,null,null,"Reviewer:"]
[null,null,null,"Typed Name",null,null,null,null,null,null,null,"Typed Name"]
[]
[]
[null,null,null,"Grantor's",null,null,"Eligibility ?","Beginning","(+)","(-)","Ending","(-)",null,"Other","June 30"]
[null,"Fund","SCEIS","Award",null,"Grant",null,"Fund","Grant Receipts","Grant Qualified","Fund","Accounts Payable",null,"Accrual","Accrual"]
[null,"Number","Grant No","Reference","CFDA","Type",null,"Balance","through June 30","Payments","Balance","Current June 30",null,"Adjustments","Fund Balance"]
[]
[null,null,null,null,null,null,null,null,null,null,{"$f":"SUM(H18:J18)","v":0},null,null,null,{"$f":"SUM(K18:N18)","v":0}]
[null,null,null,null,null,null,null,null,null,null,{"$f":"SUM(H19:J19)","v":0},null,null,null,{"$f":"SUM(K19:N19)","v":0}]
[null,null,null,null,null,null,null,null,null,null,0,null,null,null,0]
{"$rows_left_out":390}
{"sheet":"3.03.2","index":3,"n_rows":59,"n_cols":24,"rows_kept":59,"cut":false,"hidden":false,"merged":[[57,23,57,24],[58,23,58,24],[46,23,46,24],[49,23,49,24],[50,23,50,24],[51,23,51,24],[52,23,52,24],[53,23,53,24],[54,23,54,24],[55,23,55,24],[56,23,56,24],[37,23,37,24],[38,23,38,24],[39,23,39,24],[40,23,40,24],[41,23,41,24],[42,23,42,24],[43,23,43,24],[44,23,44,24],[45,23,45,24],[25,23,25,24],[26,23,26,24],[27,23,27,24],[28,23,28,24],[29,23,29,24],[30,23,30,24],[31,23,31,24],[32,23,32,24],[36,23,36,24],[13,23,14,24],[18,23,18,24],[19,23,19,24],[20,23,20,24],[21,23,21,24],[22,23,22,24],[23,23,23,24],[24,23,24,24],[14,8,14,9],[37,8,37,9],[27,8,27,9],[27,12,27,13],[27,16,27,17],[19,8,19,9],[37,20,37,21],[38,8,38,9],[38,12,38,13],[38,16,38,17],[38,20,38,21],[24,12,24,13],[27,20,27,21],[28,8,28,9],[28,12,28,13],[28,16,28,17],[28,20,28,21],[25,20,25,21],[26,20,26,21],[7,7,7,16],[18,16,18,17],[43,12,43,13],[43,16,43,17],[19,16,19,17],[23,16,23,17],[29,8,29,9],[29,12,29,13],[29,16,29,17],[30,8,30,9],[30,12,30,13],[30,16,30,17],[31,8,31,9],[31,12,31,13],[31,16,31,17],[14,12,14,13],[18,8,18,9],[18,12,18,13],[25,16,25,17],[26,16,26,17],[10,4,10,10],[10,13,10,21],[39,8,39,9],[39,12,39,13],[40,8,40,9],[40,12,40,13],[43,20,43,21],[40,16,40,17],[14,15,14,18],[14,20,14,21],[18,20,18,21],[36,8,36,9],[36,12,36,13],[36,16,36,17],[36,20,36,21],[25,12,25,13],[26,12,26,13],[32,12,32,13],[29,20,29,21],[30,20,30,21],[31,20,31,21],[19,12,19,13],[20,12,20,13],[21,12,21,13],[22,12,22,13],[23,12,23,13],[39,16,39,17],[39,20,39,21],[41,20,41,21],[42,8,42,9],[42,12,42,13],[42,16,42,17],[42,20,42,21],[43,8,43,9],[41,12,41,13],[49,8,49,9],[49,12,49,13],[58,8,58,9],[50,12,50,13],[51,12,51,13],[52,12,52,13],[53,12,53,13],[54,12,54,13],[32,16,32,17],[32,20,32,21],[50,8,50,9],[51,8,51,9],[52,8,52,9],[53,8,53,9],[49,20,49,21],[45,8,45,9],[45,12,45,13],[45,16,45,17],[45,20,45,21],[32,8,32,9],[44,8,44,9],[53,16,53,17],[54,16,54,17],[55,16,55,17],[41,16,41,17],[37,12,37,13],[54,8,54,9],[55,8,55,9],[19,20,19,21],[20,16,20,17],[20,20,20,21],[21,16,21,17],[21,20,21,21],[22,16,22,17],[22,20,22,21],[20,8,20,9],[21,8,21,9],[22,8,22,9],[23,8,23,9],[24,8,24,9],[25,8,25,9],[26,8,26,9],[23,20,23,21],[24,16,24,17],[24,20,24,21],[44,12,44,13],[44,16,44,17],[44,20,44,21],[40,20,40,21],[41,8,41,9],[58,12,58,13],[50,16,50,17],[56,8,56,9],[57,8,57,9],[57,20,57,21],[58,20,58,21],[13,8,13,17],[56,16,56,17],[57,16,57,17],[58,16,58,17],[50,20,50,21],[51,20,51,21],[52,20,52,21],[53,20,53,21],[54,20,54,21],[55,20,55,21],[56,20,56,21],[55,12,55,13],[56,12,56,13],[57,12,57,13],[49,16,49,17],[37,16,37,17],[51,16,51,17],[52,16,52,17]]}
[]
[null,"STATE OF SOUTH CAROLINA"]
[null,"GRANTS RECEIVABLES AND DEFERRED REVENUE"]
[null,"SUMMARY FORM"]
[null,null,null,null,null,null,null,null,null,null,null,"AT JUNE 30,",{"$f":"IF('3.03.1'!J4=\"\",\"\",'3.03.1'!J4)","v":2019}]
[]
[]
[null,null,"Agency:",null,{"$f":"IF('3.03.1'!C7=\"\",\"\",'3.03.1'!C7)","v":0},null,null,{"$f":"+'Signature 1'!E6","v":""}]
[null,null,null,null,"Business Area",null,null,null,null,null,null,null,"Name"]
[]
[null,null,"Preparer:",null,null,null,null,null,null,null,null,null,"Reviewer:"]
[null,null,null,null,null,"Typed Name",null,null,null,null,null,null,null,null,null,null,"Typed Name"]
[]
[null,null,null,null,null,null,null,null,"Receivable Balances",null,null,null,null,null,null,null,null,null,null,null,null,null,null,"Accounts Payable"]
[null,null,"Fund No",null,"Account Description",null,null,null,"Total",null,null,null,"Current",null,null,"Non-Current",null,null,null,null,"Deferred Revenue"]
[]
[null,null,"Operating Grants - Federal or other"]
[]
[null,null,null,null,{"$f":"IF(C19=\"\",\"\",IF(VALUE(LEFT(C19,1))=5,\"Federal Grant Revenue\",\"Other Grant Revenue\"))","v":""},null,null,"$",{"$f":"-SUMIFS('3.03.1'!O$18:O$404,'3.03.1'!B$18:B$404,'3.03.2'!C19,'3.03.1'!O$18:O$404,\"<0\",'3.03.1'!F$18:F$404,\"Operating\")","v":0},null,null,"$",null,null,null,"$",{"$f":"IF(I19<0,\"Error - No current should be reported\",I19-M19)","v":0},null,null,"$",{"$f":"SUMIFS('3.03.1'!O$18:O$404,'3.03.1'!B$18:B$404,'3.03.2'!C19,'3.03.1'!O$18:O$404,\">0\",'3.03.1'!F$18:F$404,\"Operating\")","v":0},null,"$",{"$f":"SUMIFS('3.03.1'!L$18:L$404,'3.03.1'!B$18:B$404,'3.03.2'!C19,'3.03.1'!L$18:L$404,\"<0\",'3.03.1'!F$18:F$404,\"Operating\")","v":0}]
[null,null,null,null,{"$f":"IF(C20=\"\",\"\",IF(VALUE(LEFT(C20,1))=5,\"Federal Grant Revenue\",\"Other Grant Revenue\"))","v":""},null,null,null,{"$f":"-SUMIFS('3.03.1'!O$18:O$404,'3.03.1'!B$18:B$404,'3.03.2'!C20,'3.03.1'!O$18:O$404,\"<0\",'3.03.1'!F$18:F$404,\"Operating\")","v":0},null,null,null,null,null,null,null,{"$f":"IF(I20<0,\"Error - No current should be reported\",I20-M20)","v":0},null,null,null,{"$f":"SUMIFS('3.03.1'!O$18:O$404,'3.03.1'!B$18:B$404,'3.03.2'!C20,'3.03.1'!O$18:O$404,\">0\",'3.03.1'!F$18:F$404,\"Operating\")","v":0},null,null,{"$f":"SUMIFS('3.03.1'!L$18:L$404,'3.03.1'!B$18:B$404,'3.03.2'!C20,'3.03.1'!L$18:L$404,\"<0\",'3.03.1'!F$18:F$404,\"Operating\")","v":0}]
{"$rows_left_out":40}
{"sheet":"3.03.3","index":4,"n_rows":59,"n_cols":21,"rows_kept":59,"cut":false,"hidden":false,"merged":[[13,8,13,17],[14,8,14,9],[14,12,14,13],[14,15,14,18],[7,7,7,16],[14,20,14,21],[18,8,18,9],[18,12,18,13],[18,16,18,17],[18,20,18,21],[10,4,10,10],[10,13,10,21],[19,8,19,9],[19,12,19,13],[19,16,19,17],[19,20,19,21],[22,8,22,9],[22,12,22,13],[22,16,22,17],[22,20,22,21],[23,8,23,9],[23,12,23,13],[23,16,23,17],[23,20,23,21],[20,8,20,9],[20,12,20,13],[20,16,20,17],[20,20,20,21],[21,8,21,9],[21,12,21,13],[21,16,21,17],[21,20,21,21],[26,16,26,17],[26,20,26,21],[27,8,27,9],[27,12,27,13],[27,16,27,17],[27,20,27,21],[24,8,24,9],[24,12,24,13],[24,16,24,17],[24,20,24,21],[25,8,25,9],[25,12,25,13],[25,16,25,17],[25,20,25,21],[30,20,30,21],[31,8,31,9],[31,12,31,13],[31,16,31,17],[31,20,31,21],[28,8,28,9],[28,12,28,13],[28,16,28,17],[28,20,28,21],[29,8,29,9],[29,12,29,13],[29,16,29,17],[29,20,29,21],[37,20,37,21],[38,8,38,9],[38,12,38,13],[38,16,38,17],[38,20,38,21],[32,8,32,9],[32,12,32,13],[32,16,32,17],[32,20,32,21],[36,8,36,9],[36,12,36,13],[36,16,36,17],[36,20,36,21],[41,20,41,21],[42,8,42,9],[42,12,42,13],[42,16,42,17],[42,20,42,21],[39,8,39,9],[39,12,39,13],[39,16,39,17],[39,20,39,21],[40,8,40,9],[40,12,40,13],[40,16,40,17],[40,20,40,21],[45,20,45,21],[49,8,49,9],[49,12,49,13],[49,16,49,17],[49,20,49,21],[43,8,43,9],[43,12,43,13],[43,16,43,17],[43,20,43,21],[44,8,44,9],[44,12,44,13],[44,16,44,17],[44,20,44,21],[52,20,52,21],[53,8,53,9],[53,12,53,13],[53,16,53,17],[53,20,53,21],[50,8,50,9],[50,12,50,13],[50,16,50,17],[50,20,50,21],[51,8,51,9],[51,12,51,13],[51,16,51,17],[51,20,51,21],[58,20,58,21],[18,4,18,5],[19,4,19,5],[20,4,20,5],[21,4,21,5],[22,4,22,5],[56,8,56,9],[56,12,56,13],[56,16,56,17],[56,20,56,21],[57,8,57,9],[57,12,57,13],[57,16,57,17],[57,20,57,21],[54,8,54,9],[54,12,54,13],[54,16,54,17],[54,20,54,21],[55,8,55,9],[55,12,55,13],[55,16,55,17],[55,20,55,21],[52,8,52,9],[52,12,52,13],[23,4,23,5],[24,4,24,5],[25,4,25,5],[26,4,26,5],[27,4,27,5],[28,4,28,5],[58,8,58,9],[58,12,58,13],[58,16,58,17],[52,16,52,17],[45,8,45,9],[45,12,45,13],[45,16,45,17],[41,8,41,9],[41,12,41,13],[41,16,41,17],[37,8,37,9],[37,12,37,13],[37,16,37,17],[30,8,30,9],[30,12,30,13],[30,16,30,17],[26,8,26,9],[26,12,26,13],[38,4,38,5],[39,4,39,5],[40,4,40,5],[41,4,41,5],[42,4,42,5],[43,4,43,5],[29,4,29,5],[30,4,30,5],[31,4,31,5],[32,4,32,5],[36,4,36,5],[37,4,37,5],[53,4,53,5],[54,4,54,5],[55,4,55,5],[56,4,56,5],[57,4,57,5],[58,4,58,5],[44,4,44,5],[45,4,45,5],[49,4,49,5],[50,4,50,5],[51,4,51,5],[52,4,52,5]]}
[]
[null,"STATE OF SOUTH CAROLINA"]
[null,"CONTRIBUTIONS RECEIVABLES AND DEFERRED REVENUE"]
[null,"SUMMARY FORM"]
[null,null,null,null,null,null,null,null,null,null,null,"AT JUNE 30,",{"$f":"IF('3.03.1'!J4=\"\",\"\",'3.03.1'!J4)","v":2019}]
[]
[]
[null,null,"Agency:",null,{"$f":"+'3.03.1'!C7","v":0},null,null,{"$f":"+'Signature 1'!E6","v":""}]
[null,null,null,null,"Business Area",null,null,null,null,null,null,null,"Name"]
[]
[null,null,"Preparer:",null,null,null,null,null,null,null,null,null,"Reviewer:"]
[null,null,null,null,null,"Typed Name",null,null,null,null,null,null,null,null,null,null,"Typed Name"]
[]
[null,null,null,null,null,null,null,null,"Receivable Balances"]
[null,null,"Fund No",null,"Revenue GL Account",null,null,null,"Total",null,null,null,"Current",null,null,"Non-Current",null,null,null,null,"Deferred Revenue"]
[]
[null,null,"Operating Contributions"]
[]
[null,null,null,null,null,null,null,"$",null,null,null,"$",null,null,null,"$",{"$f":"IF(I19<0,\"Error - No current should be reported\",I19-M19)","v":0},null,null,"$"]
[null,null,null,null,null,null,null,"$",null,null,null,"$",null,null,null,"$",0,null,null,"$"]
{"$rows_left_out":40}
{"sheet":"3.03.4","index":5,"n_rows":95,"n_cols":7,"rows_kept":95,"cut":false,"hidden":false,"merged":[]}
["STATE OF SOUTH CAROLINA"]
["GRANTS AND CONTRIBUTION REVENUES REPORTING PACKAGE"]
["REVIEWER CHECKLIST"]
[null,null,null,null,null,"FISCAL YEAR",{"$f":"IF('3.03.1'!J4=\"\",IF('3.03.3'!M5=\"\",\"\",'3.03.3'!M5),'3.03.1'!J4)","v":2019}]
[]
["Agency:",null,{"$f":"+'3.03.1'!C7","v":0}]
[]
[null,null,null,null,"Date Last Review Step Was Completed:   "]
[]
[]
["Reviewer's Responses:"]
[{"$f":"COUNT(A$11:A11)+1","v":1},"Is the reviewer of the form someone other than the person who prepared it?"]
[]
[{"$f":"COUNT(A$11:A13)+1","v":2},"Can all amounts reported on each form be traced to official agency accounting "]
[null,"records?"]
[]
[{"$f":"COUNT(A$11:A14)+1","v":3},"Is the information provided at a detailed level by sponsor grant award number?  "]
[]
[{"$f":"COUNT(A$11:A18)+1","v":4},"Has information been reconciled to the report provided by the Comptroller "]
[null,"General's Office?"]
{"$rows_left_out":76}
{"sheet":"Summary","index":6,"n_rows":238,"n_cols":8,"rows_kept":238,"cut":false,"hidden":true,"merged":[]}
["Business Area","Fund Number","SCEIS Grant No","Grantor's Award Reference","CFDA","Grant Type","Eligibility ?","Ending Balance"]
[{"$f":"'3.03.1'!$C$7","v":0},{"$f":"'3.03.1'!B18","v":0},{"$f":"'3.03.1'!C18","v":0},{"$f":"'3.03.1'!D18","v":0},{"$f":"'3.03.1'!E18","v":0},{"$f":"'3.03.1'!F18","v":0},{"$f":"'3.03.1'!G18","v":0},{"$f":"'3.03.1'!O18","v":0}]
[{"$f":"'3.03.1'!$C$7","v":0},{"$f":"'3.03.1'!B169","v":0},{"$f":"'3.03.1'!C169","v":0},{"$f":"'3.03.1'!D169","v":0},{"$f":"'3.03.1'!E169","v":0},{"$f":"'3.03.1'!F169","v":0},{"$f":"'3.03.1'!G169","v":0},{"$f":"'3.03.1'!O169","v":0}]
[{"$f":"'3.03.1'!$C$7","v":0},{"$f":"'3.03.1'!B170","v":0},{"$f":"'3.03.1'!C170","v":0},{"$f":"'3.03.1'!D170","v":0},{"$f":"'3.03.1'!E170","v":0},{"$f":"'3.03.1'!F170","v":0},{"$f":"'3.03.1'!G170","v":0},{"$f":"'3.03.1'!O170","v":0}]
[{"$f":"'3.03.1'!$C$7","v":0},{"$f":"'3.03.1'!B171","v":0},{"$f":"'3.03.1'!C171","v":0},{"$f":"'3.03.1'!D171","v":0},{"$f":"'3.03.1'!E171","v":0},{"$f":"'3.03.1'!F171","v":0},{"$f":"'3.03.1'!G171","v":0},{"$f":"'3.03.1'!O171","v":0}]
[{"$f":"'3.03.1'!$C$7","v":0},{"$f":"'3.03.1'!B172","v":0},{"$f":"'3.03.1'!C172","v":0},{"$f":"'3.03.1'!D172","v":0},{"$f":"'3.03.1'!E172","v":0},{"$f":"'3.03.1'!F172","v":0},{"$f":"'3.03.1'!G172","v":0},{"$f":"'3.03.1'!O172","v":0}]
[{"$f":"'3.03.1'!$C$7","v":0},{"$f":"'3.03.1'!B173","v":0},{"$f":"'3.03.1'!C173","v":0},{"$f":"'3.03.1'!D173","v":0},{"$f":"'3.03.1'!E173","v":0},{"$f":"'3.03.1'!F173","v":0},{"$f":"'3.03.1'!G173","v":0},{"$f":"'3.03.1'!O173","v":0}]
[{"$f":"'3.03.1'!$C$7","v":0},{"$f":"'3.03.1'!B174","v":0},{"$f":"'3.03.1'!C174","v":0},{"$f":"'3.03.1'!D174","v":0},{"$f":"'3.03.1'!E174","v":0},{"$f":"'3.03.1'!F174","v":0},{"$f":"'3.03.1'!G174","v":0},{"$f":"'3.03.1'!O174","v":0}]
[{"$f":"'3.03.1'!$C$7","v":0},{"$f":"'3.03.1'!B175","v":0},{"$f":"'3.03.1'!C175","v":0},{"$f":"'3.03.1'!D175","v":0},{"$f":"'3.03.1'!E175","v":0},{"$f":"'3.03.1'!F175","v":0},{"$f":"'3.03.1'!G175","v":0},{"$f":"'3.03.1'!O175","v":0}]
[{"$f":"'3.03.1'!$C$7","v":0},{"$f":"'3.03.1'!B176","v":0},{"$f":"'3.03.1'!C176","v":0},{"$f":"'3.03.1'!D176","v":0},{"$f":"'3.03.1'!E176","v":0},{"$f":"'3.03.1'!F176","v":0},{"$f":"'3.03.1'!G176","v":0},{"$f":"'3.03.1'!O176","v":0}]
[{"$f":"'3.03.1'!$C$7","v":0},{"$f":"'3.03.1'!B177","v":0},{"$f":"'3.03.1'!C177","v":0},{"$f":"'3.03.1'!D177","v":0},{"$f":"'3.03.1'!E177","v":0},{"$f":"'3.03.1'!F177","v":0},{"$f":"'3.03.1'!G177","v":0},{"$f":"'3.03.1'!O177","v":0}]
[{"$f":"'3.03.1'!$C$7","v":0},{"$f":"'3.03.1'!B178","v":0},{"$f":"'3.03.1'!C178","v":0},{"$f":"'3.03.1'!D178","v":0},{"$f":"'3.03.1'!E178","v":0},{"$f":"'3.03.1'!F178","v":0},{"$f":"'3.03.1'!G178","v":0},{"$f":"'3.03.1'!O178","v":0}]
[{"$f":"'3.03.1'!$C$7","v":0},{"$f":"'3.03.1'!B179","v":0},{"$f":"'3.03.1'!C179","v":0},{"$f":"'3.03.1'!D179","v":0},{"$f":"'3.03.1'!E179","v":0},{"$f":"'3.03.1'!F179","v":0},{"$f":"'3.03.1'!G179","v":0},{"$f":"'3.03.1'!O179","v":0}]
[{"$f":"'3.03.1'!$C$7","v":0},{"$f":"'3.03.1'!B180","v":0},{"$f":"'3.03.1'!C180","v":0},{"$f":"'3.03.1'!D180","v":0},{"$f":"'3.03.1'!E180","v":0},{"$f":"'3.03.1'!F180","v":0},{"$f":"'3.03.1'!G180","v":0},{"$f":"'3.03.1'!O180","v":0}]
[{"$f":"'3.03.1'!$C$7","v":0},{"$f":"'3.03.1'!B181","v":0},{"$f":"'3.03.1'!C181","v":0},{"$f":"'3.03.1'!D181","v":0},{"$f":"'3.03.1'!E181","v":0},{"$f":"'3.03.1'!F181","v":0},{"$f":"'3.03.1'!G181","v":0},{"$f":"'3.03.1'!O181","v":0}]
[{"$f":"'3.03.1'!$C$7","v":0},{"$f":"'3.03.1'!B182","v":0},{"$f":"'3.03.1'!C182","v":0},{"$f":"'3.03.1'!D182","v":0},{"$f":"'3.03.1'!E182","v":0},{"$f":"'3.03.1'!F182","v":0},{"$f":"'3.03.1'!G182","v":0},{"$f":"'3.03.1'!O182","v":0}]
[{"$f":"'3.03.1'!$C$7","v":0},{"$f":"'3.03.1'!B183","v":0},{"$f":"'3.03.1'!C183","v":0},{"$f":"'3.03.1'!D183","v":0},{"$f":"'3.03.1'!E183","v":0},{"$f":"'3.03.1'!F183","v":0},{"$f":"'3.03.1'!G183","v":0},{"$f":"'3.03.1'!O183","v":0}]
[{"$f":"'3.03.1'!$C$7","v":0},{"$f":"'3.03.1'!B184","v":0},{"$f":"'3.03.1'!C184","v":0},{"$f":"'3.03.1'!D184","v":0},{"$f":"'3.03.1'!E184","v":0},{"$f":"'3.03.1'!F184","v":0},{"$f":"'3.03.1'!G184","v":0},{"$f":"'3.03.1'!O184","v":0}]
[{"$f":"'3.03.1'!$C$7","v":0},{"$f":"'3.03.1'!B185","v":0},{"$f":"'3.03.1'!C185","v":0},{"$f":"'3.03.1'!D185","v":0},{"$f":"'3.03.1'!E185","v":0},{"$f":"'3.03.1'!F185","v":0},{"$f":"'3.03.1'!G185","v":0},{"$f":"'3.03.1'!O185","v":0}]
[{"$f":"'3.03.1'!$C$7","v":0},{"$f":"'3.03.1'!B186","v":0},{"$f":"'3.03.1'!C186","v":0},{"$f":"'3.03.1'!D186","v":0},{"$f":"'3.03.1'!E186","v":0},{"$f":"'3.03.1'!F186","v":0},{"$f":"'3.03.1'!G186","v":0},{"$f":"'3.03.1'!O186","v":0}]
{"$rows_left_out":218}