{"text_format":"1","workbook":"xlsx","n_sheets":8,"sheets":["Yearly Data","Instructions","Signature Page","3.02.1","3.02.2","3.02.3","3.02.4","Summary"],"not_rendered":{"charts":0,"images":0,"macros":1,"external_links":0,"defined_names":6,"comments":0,"pivot_tables":0},"unopened":[],"bounds":{"document_bytes":16777216,"sheet_cells":100000,"rows_first":2000,"rows_last":500,"rows_between":2000,"halvings":0,"cell_chars":16384,"cell_head_chars":4096},"cells_cut":0,"cells_raw":0,"read":"whole","date_system":"1900"}

{"sheet":"Yearly Data","index":0,"n_rows":99,"n_cols":3,"rows_kept":99,"cut":false,"hidden":true,"merged":[]}
["Year",2019]
[]
[]
["The following information must be reviewed and updated as necessary anually:"]
[]
["AGCY  CODE","AGENCY NAME","FY Added"]
["A010","LEGISLATIVE DEPARTMENT - THE SENATE"]
["A050","LEGISLATIVE DEPARTMENT - HOUSE OF REPRESENTATIVES"]
["A150","LEGISLATIVE DEPARTMENT - CODIFICATION OF LAWS & LEGISLATIVE COUNCIL"]
["A170","LEGISLATIVE DEPARTMENT - LEGISLATIVE SERVICES AGENCY"]
["A200","LEGISLATIVE DEPARTMENT - LEGISLATIVE AUDIT COUNCIL"]
["A850","EDUCATION OVERSIGHT COMMITTEE"]
["B040","JUDICIAL DEPARTMENT"]
["C050","ADMINISTRATIVE LAW JUDGES"]
["D050","GOVERNOR'S OFFICE--EXECUTIVE CONTROL OF STATE"]
["D100","GOVERNOR'S OFFICE--STATE LAW ENFORCEMENT DIVISION"]
["D170","GOVERNOR'S OFFICE-- EXECUTIVE POLICY & PROGRAMS"]
["D200","GOVERNOR'S OFFICE--MANSION & GROUNDS"]
["D250","INSPECTOR GENERAL"]
["D500","DEPARTMENT OF ADMINSTRATION"]
{"$rows_left_out":80}
{"sheet":"Instructions","index":1,"n_rows":107,"n_cols":7,"rows_kept":107,"cut":false,"hidden":false,"merged":[[0,0,0,13],[1,0,1,13],[2,0,2,13]]}
["STATE OF SOUTH CAROLINA"]
["YEAR-END REPORTING PROCEDURES MANUAL"]
["SECTION 3.02, TAX REVENUES YEAR-END REPORTING PACKAGE"]
[]
[]
[null,"PURPOSE and OBJECTIVE:"]
[null,"Accurate reporting of tax revenues in accordance with GAAP require the reporting of tax receivables, "]
[null,"allowances for uncollectible taxes, and tax refunds payable.  To include accurate and complete information "]
[null,"in the State's financial statements the agency's are asked to provide information regarding these balances."]
[]
[null,"Please refer to the Reporting Procedures Manual for concepts and definitions relating to this section of"]
[null,"the reporting forms.  If questions arise please call the Comptroller General's Office Division of Financial"]
[null,"Reporting."]
[]
[null,"INSTRUCTIONS FOR COMPLETION OF FORMS:"]
[]
[null,"Signature Page"]
[null,"Select your agency from the drop down box on tab 3.02.1.  The selection will populate the agency code "]
[null,"and name to the appropriate places throughout the workbook."]
[null,"Please type the name of the preparer and reviewer, their titles, e-mail address', phone numbers and date "]
{"$rows_left_out":88}
{"sheet":"Signature Page","index":2,"n_rows":44,"n_cols":6,"rows_kept":44,"cut":false,"hidden":false,"merged":[[43,1,43,5],[29,3,29,4],[35,1,35,5],[37,1,37,5],[39,1,39,5],[41,1,41,5]]}
[null,null,"TAX REVENUE REPORTING PACKAGE SIGNATURE PAGE"]
[]
[]
[null,null,"CAFR Reporting Period:",null,{"$f":"Year","v":2019}]
[null,null,"Agency Number:",null,null,"*"]
[null,null,"Agency Name",null,{"$f":"IF(ISERROR(VLOOKUP(AgencyCode,'Yearly Data'!A7:B86,2,FALSE))=TRUE,\"\",VLOOKUP(AgencyCode,'Yearly Data'!A7:B86,2,FALSE))","v":""}]
[]
[]
[]
[null,null,null,null,"Before completing this package, please answer the following question."]
[null,null,null,null,"Is Reporting Package 3.02 required based on the Master Reporting Package?"]
[]
[null,null,"Preparer","Date:",null,"*"]
[null,null,null,"Name:",null,"*"]
[null,null,null,"Title:",null,"*"]
[null,null,null,"e-mail:",null,"*"]
[null,null,null,"Phone Number:",null,"*"]
[null,null,null,"Signature:",null,"*"]
[]
[null,null,{"$f":"IF('3.02.4'!C38=TRUE,\"The review of the closing package is incomplete.\",\"\")","v":"The review of the closing package is incomplete."}]
{"$rows_left_out":25}
{"sheet":"3.02.1","index":3,"n_rows":128,"n_cols":12,"rows_kept":128,"cut":false,"hidden":false,"merged":[[6,3,6,10],[0,0,0,11],[1,0,1,11],[2,0,2,11],[5,3,5,10]]}
["STATE OF SOUTH CAROLINA"]
["TAX RECEIVABLE SUMMARY FORM"]
[{"$f":"\"At June 30, \"&Year","v":"At June 30, 2019"}]
[]
[]
["Agency:",{"$f":"IF(AgencyCode=\"\",\"\",AgencyCode)","v":""},null,{"$f":"IF(AgencyName=\"\",\"Please choose your agency number on the Signature Page form.\",AgencyName)","v":"Please choose your agency number on the Signature Page form."}]
[null,"Business Area",null,"Name"]
[]
[]
[]
["Order","Tax Type","Fund Number","Gross Receivables","Allowance for Uncollectible Amounts","Net Receivable","Are these accrual balances recorded in SCEIS?","Other Credit Acct needed","Current Net Receivable","Non-Current Receivable","General Ledger Offset","Status"]
[1,null,null,null,null,{"$f":"IF(D12=\"\",\"\",D12-E12)","v":""},null,null,null,{"$f":"IF(ISERROR(F12-I12)=TRUE,\"\",F12-I12)","v":""},{"$f":"IF(ISERROR(VLOOKUP(B12,$B$120:$C$128,2,FALSE))=TRUE,\"\",VLOOKUP(B12,$B$120:$C$128,2,FALSE))","v":""},{"$f":"IF(B12=\"\",\"\",IF(OR(F12=\"\",I12=\"\")=TRUE,\"INCOMPLETE\",\"\"))","v":""}]
[2,null,null,null,null,{"$f":"IF(D13=\"\",\"\",D13-E13)","v":""},null,null,null,{"$f":"IF(ISERROR(F13-I13)=TRUE,\"\",F13-I13)","v":""},{"$f":"IF(ISERROR(VLOOKUP(B13,$B$120:$C$128,2,FALSE))=TRUE,\"\",VLOOKUP(B13,$B$120:$C$128,2,FALSE))","v":""},{"$f":"IF(B13=\"\",\"\",IF(OR(F13=\"\",I13=\"\")=TRUE,\"INCOMPLETE\",\"\"))","v":""}]
[3,null,null,null,null,"",null,null,null,"","",""]
[4,null,null,null,null,"",null,null,null,"","",""]
[5,null,null,null,null,"",null,null,null,"","",""]
[6,null,null,null,null,"",null,null,null,"","",""]
[7,null,null,null,null,"",null,null,null,"","",""]
[8,null,null,null,null,"",null,null,null,"","",""]
[9,null,null,null,null,"",null,null,null,"","",""]
{"$rows_left_out":109}
{"sheet":"3.02.2","index":4,"n_rows":122,"n_cols":5,"rows_kept":122,"cut":false,"hidden":false,"merged":[[6,3,6,8],[0,0,0,10],[1,0,1,10],[2,0,2,10],[5,3,5,9]]}
["STATE OF SOUTH CAROLINA"]
["TAX REFUNDS PAYABLE SUMMARY FORM"]
[{"$f":"\"At June 30, \"&Year","v":"At June 30, 2019"}]
[]
[]
["Agency:",{"$f":"IF(AgencyCode=\"\",\"\",AgencyCode)","v":""},null,{"$f":"IF(AgencyName=\"\",\"Please choose your agency number on the Signature Page form.\",AgencyName)","v":"Please choose your agency number on the Signature Page form."}]
[null,"Business Area",null,"Name"]
[]
[]
[]
["Order","Tax Type","Fund Number","Tax Refund Payable","Revenue GL to Reduce"]
[1]
[2]
[3]
[4]
[5]
[6]
[7]
[8]
[9]
{"$rows_left_out":103}
{"sheet":"3.02.3","index":5,"n_rows":122,"n_cols":5,"rows_kept":122,"cut":false,"hidden":false,"merged":[[0,0,0,10],[1,0,1,10],[2,0,2,10],[6,3,6,8],[5,3,5,9]]}
["STATE OF SOUTH CAROLINA"]
["DEFERRED TAX REVENUES SUMMARY FORM"]
[{"$f":"\"At June 30, \"&Year","v":"At June 30, 2019"}]
[]
[]
["Agency:",{"$f":"IF(AgencyCode=\"\",\"\",AgencyCode)","v":""},null,{"$f":"IF(AgencyName=\"\",\"Please choose your agency number on the Signature Page form.\",AgencyName)","v":"Please choose your agency number on the Signature Page form."}]
[null,"Business Area",null,"Name"]
[]
[]
[]
["Order","Tax Type","Fund Number","Deferred Revenue","Revenue GL to Reduce"]
[1]
[2]
[3]
[4]
[5]
[6]
[7]
[8]
[9]
{"$rows_left_out":103}
{"sheet":"3.02.4","index":6,"n_rows":38,"n_cols":3,"rows_kept":38,"cut":false,"hidden":false,"merged":[[2,0,2,3],[3,0,3,3]]}
["STATE OF SOUTH CAROLINA"]
["TAX REVENUES REPORTING PACKAGE"]
["REVIEWER CHECKLIST"]
[{"$f":"IF(Year=\"\",\"\",\"FISCAL YEAR \"&Year)","v":"FISCAL YEAR 2019"}]
[]
["Reviewed by:"]
[null,"Reviewer's Name"]
[]
[null,"Date Last Review Step Was Completed:   "]
[]
["Review Responses:"]
[{"$f":"COUNT(A$11:A11)+1","v":1},"Is the reviewer of the form someone other than the person who prepared it?"]
[]
[{"$f":"COUNT(A$11:A13)+1","v":2},"Does each form contain the typed name of the preparer and reviewer? "]
[]
[{"$f":"COUNT(A$11:A15)+1","v":3},"Can all amounts reported on each form be traced to official agency accounting records?"]
[]
[{"$f":"COUNT(A$11:A17)+1","v":4},"Are the fund numbers reported where the majority of activity for this type recorded?"]
[]
[{"$f":"COUNT(A$11:A19)+1","v":5},"Has the balances and activity reporting been compared with the prior year, documenting causes for any large fluctuations that can be easily obtained and explained to individuals not familiar with the daily operations of the agency?"]
{"$rows_left_out":19}
{"sheet":"Summary","index":7,"n_rows":313,"n_cols":14,"rows_kept":313,"cut":false,"hidden":true,"merged":[]}
["Agency","Workpaper","Order","Tax Type","Fund Number","Gross Receivables","Allowance for Uncollectible Amounts","Net Receivable","Are these accrual balances recorded in SCEIS?","Other Credit Acct needed","Current Net Receivable","Non-Current Receivable","General Ledger Offset","Status"]
[{"$f":"IF(AgencyCode=\"\",\"\",AgencyCode)","v":""},"3.02.1",{"$f":"'3.02.1'!A12","v":1},{"$f":"IF('3.02.1'!B12=\"\",\"\",'3.02.1'!B12)","v":""},{"$f":"IF('3.02.1'!C12=\"\",\"\",'3.02.1'!C12)","v":""},{"$f":"IF('3.02.1'!D12=\"\",\"\",'3.02.1'!D12)","v":""},{"$f":"IF('3.02.1'!E12=\"\",\"\",'3.02.1'!E12)","v":""},{"$f":"IF('3.02.1'!F12=\"\",\"\",'3.02.1'!F12)","v":""},{"$f":"IF('3.02.1'!G12=\"\",\"\",'3.02.1'!G12)","v":""},{"$f":"IF('3.02.1'!H12=\"\",\"\",'3.02.1'!H12)","v":""},{"$f":"IF('3.02.1'!I12=\"\",\"\",'3.02.1'!I12)","v":""},{"$f":"IF('3.02.1'!J12=\"\",\"\",'3.02.1'!J12)","v":""},{"$f":"IF('3.02.1'!K12=\"\",\"\",'3.02.1'!K12)","v":""},{"$f":"IF('3.02.1'!L12=\"\",\"\",'3.02.1'!L12)","v":""}]
["","3.02.1",{"$f":"'3.02.1'!A13","v":2},{"$f":"IF('3.02.1'!B13=\"\",\"\",'3.02.1'!B13)","v":""},{"$f":"IF('3.02.1'!C13=\"\",\"\",'3.02.1'!C13)","v":""},{"$f":"IF('3.02.1'!D13=\"\",\"\",'3.02.1'!D13)","v":""},{"$f":"IF('3.02.1'!E13=\"\",\"\",'3.02.1'!E13)","v":""},{"$f":"IF('3.02.1'!F13=\"\",\"\",'3.02.1'!F13)","v":""},{"$f":"IF('3.02.1'!G13=\"\",\"\",'3.02.1'!G13)","v":""},{"$f":"IF('3.02.1'!H13=\"\",\"\",'3.02.1'!H13)","v":""},{"$f":"IF('3.02.1'!I13=\"\",\"\",'3.02.1'!I13)","v":""},{"$f":"IF('3.02.1'!J13=\"\",\"\",'3.02.1'!J13)","v":""},{"$f":"IF('3.02.1'!K13=\"\",\"\",'3.02.1'!K13)","v":""},{"$f":"IF('3.02.1'!L13=\"\",\"\",'3.02.1'!L13)","v":""}]
["","3.02.1",{"$f":"'3.02.1'!A14","v":3},{"$f":"IF('3.02.1'!B14=\"\",\"\",'3.02.1'!B14)","v":""},{"$f":"IF('3.02.1'!C14=\"\",\"\",'3.02.1'!C14)","v":""},{"$f":"IF('3.02.1'!D14=\"\",\"\",'3.02.1'!D14)","v":""},{"$f":"IF('3.02.1'!E14=\"\",\"\",'3.02.1'!E14)","v":""},{"$f":"IF('3.02.1'!F14=\"\",\"\",'3.02.1'!F14)","v":""},{"$f":"IF('3.02.1'!G14=\"\",\"\",'3.02.1'!G14)","v":""},{"$f":"IF('3.02.1'!H14=\"\",\"\",'3.02.1'!H14)","v":""},{"$f":"IF('3.02.1'!I14=\"\",\"\",'3.02.1'!I14)","v":""},{"$f":"IF('3.02.1'!J14=\"\",\"\",'3.02.1'!J14)","v":""},{"$f":"IF('3.02.1'!K14=\"\",\"\",'3.02.1'!K14)","v":""},{"$f":"IF('3.02.1'!L14=\"\",\"\",'3.02.1'!L14)","v":""}]
["","3.02.1",{"$f":"'3.02.1'!A15","v":4},{"$f":"IF('3.02.1'!B15=\"\",\"\",'3.02.1'!B15)","v":""},{"$f":"IF('3.02.1'!C15=\"\",\"\",'3.02.1'!C15)","v":""},{"$f":"IF('3.02.1'!D15=\"\",\"\",'3.02.1'!D15)","v":""},{"$f":"IF('3.02.1'!E15=\"\",\"\",'3.02.1'!E15)","v":""},{"$f":"IF('3.02.1'!F15=\"\",\"\",'3.02.1'!F15)","v":""},{"$f":"IF('3.02.1'!G15=\"\",\"\",'3.02.1'!G15)","v":""},{"$f":"IF('3.02.1'!H15=\"\",\"\",'3.02.1'!H15)","v":""},{"$f":"IF('3.02.1'!I15=\"\",\"\",'3.02.1'!I15)","v":""},{"$f":"IF('3.02.1'!J15=\"\",\"\",'3.02.1'!J15)","v":""},{"$f":"IF('3.02.1'!K15=\"\",\"\",'3.02.1'!K15)","v":""},{"$f":"IF('3.02.1'!L15=\"\",\"\",'3.02.1'!L15)","v":""}]
["","3.02.1",{"$f":"'3.02.1'!A16","v":5},{"$f":"IF('3.02.1'!B16=\"\",\"\",'3.02.1'!B16)","v":""},{"$f":"IF('3.02.1'!C16=\"\",\"\",'3.02.1'!C16)","v":""},{"$f":"IF('3.02.1'!D16=\"\",\"\",'3.02.1'!D16)","v":""},{"$f":"IF('3.02.1'!E16=\"\",\"\",'3.02.1'!E16)","v":""},{"$f":"IF('3.02.1'!F16=\"\",\"\",'3.02.1'!F16)","v":""},{"$f":"IF('3.02.1'!G16=\"\",\"\",'3.02.1'!G16)","v":""},{"$f":"IF('3.02.1'!H16=\"\",\"\",'3.02.1'!H16)","v":""},{"$f":"IF('3.02.1'!I16=\"\",\"\",'3.02.1'!I16)","v":""},{"$f":"IF('3.02.1'!J16=\"\",\"\",'3.02.1'!J16)","v":""},{"$f":"IF('3.02.1'!K16=\"\",\"\",'3.02.1'!K16)","v":""},{"$f":"IF('3.02.1'!L16=\"\",\"\",'3.02.1'!L16)","v":""}]
["","3.02.1",{"$f":"'3.02.1'!A17","v":6},{"$f":"IF('3.02.1'!B17=\"\",\"\",'3.02.1'!B17)","v":""},{"$f":"IF('3.02.1'!C17=\"\",\"\",'3.02.1'!C17)","v":""},{"$f":"IF('3.02.1'!D17=\"\",\"\",'3.02.1'!D17)","v":""},{"$f":"IF('3.02.1'!E17=\"\",\"\",'3.02.1'!E17)","v":""},{"$f":"IF('3.02.1'!F17=\"\",\"\",'3.02.1'!F17)","v":""},{"$f":"IF('3.02.1'!G17=\"\",\"\",'3.02.1'!G17)","v":""},{"$f":"IF('3.02.1'!H17=\"\",\"\",'3.02.1'!H17)","v":""},{"$f":"IF('3.02.1'!I17=\"\",\"\",'3.02.1'!I17)","v":""},{"$f":"IF('3.02.1'!J17=\"\",\"\",'3.02.1'!J17)","v":""},{"$f":"IF('3.02.1'!K17=\"\",\"\",'3.02.1'!K17)","v":""},{"$f":"IF('3.02.1'!L17=\"\",\"\",'3.02.1'!L17)","v":""}]
["","3.02.1",{"$f":"'3.02.1'!A18","v":7},{"$f":"IF('3.02.1'!B18=\"\",\"\",'3.02.1'!B18)","v":""},{"$f":"IF('3.02.1'!C18=\"\",\"\",'3.02.1'!C18)","v":""},{"$f":"IF('3.02.1'!D18=\"\",\"\",'3.02.1'!D18)","v":""},{"$f":"IF('3.02.1'!E18=\"\",\"\",'3.02.1'!E18)","v":""},{"$f":"IF('3.02.1'!F18=\"\",\"\",'3.02.1'!F18)","v":""},{"$f":"IF('3.02.1'!G18=\"\",\"\",'3.02.1'!G18)","v":""},{"$f":"IF('3.02.1'!H18=\"\",\"\",'3.02.1'!H18)","v":""},{"$f":"IF('3.02.1'!I18=\"\",\"\",'3.02.1'!I18)","v":""},{"$f":"IF('3.02.1'!J18=\"\",\"\",'3.02.1'!J18)","v":""},{"$f":"IF('3.02.1'!K18=\"\",\"\",'3.02.1'!K18)","v":""},{"$f":"IF('3.02.1'!L18=\"\",\"\",'3.02.1'!L18)","v":""}]
["","3.02.1",{"$f":"'3.02.1'!A19","v":8},{"$f":"IF('3.02.1'!B19=\"\",\"\",'3.02.1'!B19)","v":""},{"$f":"IF('3.02.1'!C19=\"\",\"\",'3.02.1'!C19)","v":""},{"$f":"IF('3.02.1'!D19=\"\",\"\",'3.02.1'!D19)","v":""},{"$f":"IF('3.02.1'!E19=\"\",\"\",'3.02.1'!E19)","v":""},{"$f":"IF('3.02.1'!F19=\"\",\"\",'3.02.1'!F19)","v":""},{"$f":"IF('3.02.1'!G19=\"\",\"\",'3.02.1'!G19)","v":""},{"$f":"IF('3.02.1'!H19=\"\",\"\",'3.02.1'!H19)","v":""},{"$f":"IF('3.02.1'!I19=\"\",\"\",'3.02.1'!I19)","v":""},{"$f":"IF('3.02.1'!J19=\"\",\"\",'3.02.1'!J19)","v":""},{"$f":"IF('3.02.1'!K19=\"\",\"\",'3.02.1'!K19)","v":""},{"$f":"IF('3.02.1'!L19=\"\",\"\",'3.02.1'!L19)","v":""}]
["","3.02.1",{"$f":"'3.02.1'!A20","v":9},{"$f":"IF('3.02.1'!B20=\"\",\"\",'3.02.1'!B20)","v":""},{"$f":"IF('3.02.1'!C20=\"\",\"\",'3.02.1'!C20)","v":""},{"$f":"IF('3.02.1'!D20=\"\",\"\",'3.02.1'!D20)","v":""},{"$f":"IF('3.02.1'!E20=\"\",\"\",'3.02.1'!E20)","v":""},{"$f":"IF('3.02.1'!F20=\"\",\"\",'3.02.1'!F20)","v":""},{"$f":"IF('3.02.1'!G20=\"\",\"\",'3.02.1'!G20)","v":""},{"$f":"IF('3.02.1'!H20=\"\",\"\",'3.02.1'!H20)","v":""},{"$f":"IF('3.02.1'!I20=\"\",\"\",'3.02.1'!I20)","v":""},{"$f":"IF('3.02.1'!J20=\"\",\"\",'3.02.1'!J20)","v":""},{"$f":"IF('3.02.1'!K20=\"\",\"\",'3.02.1'!K20)","v":""},{"$f":"IF('3.02.1'!L20=\"\",\"\",'3.02.1'!L20)","v":""}]
["","3.02.1",{"$f":"'3.02.1'!A21","v":10},{"$f":"IF('3.02.1'!B21=\"\",\"\",'3.02.1'!B21)","v":""},{"$f":"IF('3.02.1'!C21=\"\",\"\",'3.02.1'!C21)","v":""},{"$f":"IF('3.02.1'!D21=\"\",\"\",'3.02.1'!D21)","v":""},{"$f":"IF('3.02.1'!E21=\"\",\"\",'3.02.1'!E21)","v":""},{"$f":"IF('3.02.1'!F21=\"\",\"\",'3.02.1'!F21)","v":""},{"$f":"IF('3.02.1'!G21=\"\",\"\",'3.02.1'!G21)","v":""},{"$f":"IF('3.02.1'!H21=\"\",\"\",'3.02.1'!H21)","v":""},{"$f":"IF('3.02.1'!I21=\"\",\"\",'3.02.1'!I21)","v":""},{"$f":"IF('3.02.1'!J21=\"\",\"\",'3.02.1'!J21)","v":""},{"$f":"IF('3.02.1'!K21=\"\",\"\",'3.02.1'!K21)","v":""},{"$f":"IF('3.02.1'!L21=\"\",\"\",'3.02.1'!L21)","v":""}]
["","3.02.1",{"$f":"'3.02.1'!A22","v":11},{"$f":"IF('3.02.1'!B22=\"\",\"\",'3.02.1'!B22)","v":""},{"$f":"IF('3.02.1'!C22=\"\",\"\",'3.02.1'!C22)","v":""},{"$f":"IF('3.02.1'!D22=\"\",\"\",'3.02.1'!D22)","v":""},{"$f":"IF('3.02.1'!E22=\"\",\"\",'3.02.1'!E22)","v":""},{"$f":"IF('3.02.1'!F22=\"\",\"\",'3.02.1'!F22)","v":""},{"$f":"IF('3.02.1'!G22=\"\",\"\",'3.02.1'!G22)","v":""},{"$f":"IF('3.02.1'!H22=\"\",\"\",'3.02.1'!H22)","v":""},{"$f":"IF('3.02.1'!I22=\"\",\"\",'3.02.1'!I22)","v":""},{"$f":"IF('3.02.1'!J22=\"\",\"\",'3.02.1'!J22)","v":""},{"$f":"IF('3.02.1'!K22=\"\",\"\",'3.02.1'!K22)","v":""},{"$f":"IF('3.02.1'!L22=\"\",\"\",'3.02.1'!L22)","v":""}]
["","3.02.1",{"$f":"'3.02.1'!A23","v":12},{"$f":"IF('3.02.1'!B23=\"\",\"\",'3.02.1'!B23)","v":""},{"$f":"IF('3.02.1'!C23=\"\",\"\",'3.02.1'!C23)","v":""},{"$f":"IF('3.02.1'!D23=\"\",\"\",'3.02.1'!D23)","v":""},{"$f":"IF('3.02.1'!E23=\"\",\"\",'3.02.1'!E23)","v":""},{"$f":"IF('3.02.1'!F23=\"\",\"\",'3.02.1'!F23)","v":""},{"$f":"IF('3.02.1'!G23=\"\",\"\",'3.02.1'!G23)","v":""},{"$f":"IF('3.02.1'!H23=\"\",\"\",'3.02.1'!H23)","v":""},{"$f":"IF('3.02.1'!I23=\"\",\"\",'3.02.1'!I23)","v":""},{"$f":"IF('3.02.1'!J23=\"\",\"\",'3.02.1'!J23)","v":""},{"$f":"IF('3.02.1'!K23=\"\",\"\",'3.02.1'!K23)","v":""},{"$f":"IF('3.02.1'!L23=\"\",\"\",'3.02.1'!L23)","v":""}]
["","3.02.1",{"$f":"'3.02.1'!A24","v":13},{"$f":"IF('3.02.1'!B24=\"\",\"\",'3.02.1'!B24)","v":""},{"$f":"IF('3.02.1'!C24=\"\",\"\",'3.02.1'!C24)","v":""},{"$f":"IF('3.02.1'!D24=\"\",\"\",'3.02.1'!D24)","v":""},{"$f":"IF('3.02.1'!E24=\"\",\"\",'3.02.1'!E24)","v":""},{"$f":"IF('3.02.1'!F24=\"\",\"\",'3.02.1'!F24)","v":""},{"$f":"IF('3.02.1'!G24=\"\",\"\",'3.02.1'!G24)","v":""},{"$f":"IF('3.02.1'!H24=\"\",\"\",'3.02.1'!H24)","v":""},{"$f":"IF('3.02.1'!I24=\"\",\"\",'3.02.1'!I24)","v":""},{"$f":"IF('3.02.1'!J24=\"\",\"\",'3.02.1'!J24)","v":""},{"$f":"IF('3.02.1'!K24=\"\",\"\",'3.02.1'!K24)","v":""},{"$f":"IF('3.02.1'!L24=\"\",\"\",'3.02.1'!L24)","v":""}]
["","3.02.1",{"$f":"'3.02.1'!A25","v":14},{"$f":"IF('3.02.1'!B25=\"\",\"\",'3.02.1'!B25)","v":""},{"$f":"IF('3.02.1'!C25=\"\",\"\",'3.02.1'!C25)","v":""},{"$f":"IF('3.02.1'!D25=\"\",\"\",'3.02.1'!D25)","v":""},{"$f":"IF('3.02.1'!E25=\"\",\"\",'3.02.1'!E25)","v":""},{"$f":"IF('3.02.1'!F25=\"\",\"\",'3.02.1'!F25)","v":""},{"$f":"IF('3.02.1'!G25=\"\",\"\",'3.02.1'!G25)","v":""},{"$f":"IF('3.02.1'!H25=\"\",\"\",'3.02.1'!H25)","v":""},{"$f":"IF('3.02.1'!I25=\"\",\"\",'3.02.1'!I25)","v":""},{"$f":"IF('3.02.1'!J25=\"\",\"\",'3.02.1'!J25)","v":""},{"$f":"IF('3.02.1'!K25=\"\",\"\",'3.02.1'!K25)","v":""},{"$f":"IF('3.02.1'!L25=\"\",\"\",'3.02.1'!L25)","v":""}]
["","3.02.1",{"$f":"'3.02.1'!A26","v":15},{"$f":"IF('3.02.1'!B26=\"\",\"\",'3.02.1'!B26)","v":""},{"$f":"IF('3.02.1'!C26=\"\",\"\",'3.02.1'!C26)","v":""},{"$f":"IF('3.02.1'!D26=\"\",\"\",'3.02.1'!D26)","v":""},{"$f":"IF('3.02.1'!E26=\"\",\"\",'3.02.1'!E26)","v":""},{"$f":"IF('3.02.1'!F26=\"\",\"\",'3.02.1'!F26)","v":""},{"$f":"IF('3.02.1'!G26=\"\",\"\",'3.02.1'!G26)","v":""},{"$f":"IF('3.02.1'!H26=\"\",\"\",'3.02.1'!H26)","v":""},{"$f":"IF('3.02.1'!I26=\"\",\"\",'3.02.1'!I26)","v":""},{"$f":"IF('3.02.1'!J26=\"\",\"\",'3.02.1'!J26)","v":""},{"$f":"IF('3.02.1'!K26=\"\",\"\",'3.02.1'!K26)","v":""},{"$f":"IF('3.02.1'!L26=\"\",\"\",'3.02.1'!L26)","v":""}]
["","3.02.1",{"$f":"'3.02.1'!A27","v":16},{"$f":"IF('3.02.1'!B27=\"\",\"\",'3.02.1'!B27)","v":""},{"$f":"IF('3.02.1'!C27=\"\",\"\",'3.02.1'!C27)","v":""},{"$f":"IF('3.02.1'!D27=\"\",\"\",'3.02.1'!D27)","v":""},{"$f":"IF('3.02.1'!E27=\"\",\"\",'3.02.1'!E27)","v":""},{"$f":"IF('3.02.1'!F27=\"\",\"\",'3.02.1'!F27)","v":""},{"$f":"IF('3.02.1'!G27=\"\",\"\",'3.02.1'!G27)","v":""},{"$f":"IF('3.02.1'!H27=\"\",\"\",'3.02.1'!H27)","v":""},{"$f":"IF('3.02.1'!I27=\"\",\"\",'3.02.1'!I27)","v":""},{"$f":"IF('3.02.1'!J27=\"\",\"\",'3.02.1'!J27)","v":""},{"$f":"IF('3.02.1'!K27=\"\",\"\",'3.02.1'!K27)","v":""},{"$f":"IF('3.02.1'!L27=\"\",\"\",'3.02.1'!L27)","v":""}]
["","3.02.1",{"$f":"'3.02.1'!A28","v":17},{"$f":"IF('3.02.1'!B28=\"\",\"\",'3.02.1'!B28)","v":""},{"$f":"IF('3.02.1'!C28=\"\",\"\",'3.02.1'!C28)","v":""},{"$f":"IF('3.02.1'!D28=\"\",\"\",'3.02.1'!D28)","v":""},{"$f":"IF('3.02.1'!E28=\"\",\"\",'3.02.1'!E28)","v":""},{"$f":"IF('3.02.1'!F28=\"\",\"\",'3.02.1'!F28)","v":""},{"$f":"IF('3.02.1'!G28=\"\",\"\",'3.02.1'!G28)","v":""},{"$f":"IF('3.02.1'!H28=\"\",\"\",'3.02.1'!H28)","v":""},{"$f":"IF('3.02.1'!I28=\"\",\"\",'3.02.1'!I28)","v":""},{"$f":"IF('3.02.1'!J28=\"\",\"\",'3.02.1'!J28)","v":""},{"$f":"IF('3.02.1'!K28=\"\",\"\",'3.02.1'!K28)","v":""},{"$f":"IF('3.02.1'!L28=\"\",\"\",'3.02.1'!L28)","v":""}]
["","3.02.1",{"$f":"'3.02.1'!A29","v":18},{"$f":"IF('3.02.1'!B29=\"\",\"\",'3.02.1'!B29)","v":""},{"$f":"IF('3.02.1'!C29=\"\",\"\",'3.02.1'!C29)","v":""},{"$f":"IF('3.02.1'!D29=\"\",\"\",'3.02.1'!D29)","v":""},{"$f":"IF('3.02.1'!E29=\"\",\"\",'3.02.1'!E29)","v":""},{"$f":"IF('3.02.1'!F29=\"\",\"\",'3.02.1'!F29)","v":""},{"$f":"IF('3.02.1'!G29=\"\",\"\",'3.02.1'!G29)","v":""},{"$f":"IF('3.02.1'!H29=\"\",\"\",'3.02.1'!H29)","v":""},{"$f":"IF('3.02.1'!I29=\"\",\"\",'3.02.1'!I29)","v":""},{"$f":"IF('3.02.1'!J29=\"\",\"\",'3.02.1'!J29)","v":""},{"$f":"IF('3.02.1'!K29=\"\",\"\",'3.02.1'!K29)","v":""},{"$f":"IF('3.02.1'!L29=\"\",\"\",'3.02.1'!L29)","v":""}]
["","3.02.1",{"$f":"'3.02.1'!A30","v":19},{"$f":"IF('3.02.1'!B30=\"\",\"\",'3.02.1'!B30)","v":""},{"$f":"IF('3.02.1'!C30=\"\",\"\",'3.02.1'!C30)","v":""},{"$f":"IF('3.02.1'!D30=\"\",\"\",'3.02.1'!D30)","v":""},{"$f":"IF('3.02.1'!E30=\"\",\"\",'3.02.1'!E30)","v":""},{"$f":"IF('3.02.1'!F30=\"\",\"\",'3.02.1'!F30)","v":""},{"$f":"IF('3.02.1'!G30=\"\",\"\",'3.02.1'!G30)","v":""},{"$f":"IF('3.02.1'!H30=\"\",\"\",'3.02.1'!H30)","v":""},{"$f":"IF('3.02.1'!I30=\"\",\"\",'3.02.1'!I30)","v":""},{"$f":"IF('3.02.1'!J30=\"\",\"\",'3.02.1'!J30)","v":""},{"$f":"IF('3.02.1'!K30=\"\",\"\",'3.02.1'!K30)","v":""},{"$f":"IF('3.02.1'!L30=\"\",\"\",'3.02.1'!L30)","v":""}]
{"$rows_left_out":293}