{"text_format":"1","workbook":"xlsx","n_sheets":9,"sheets":["Revisions","Yearly Data","Instructions","Signature Page","3.01.1","3.01.2","3.01.3","3.01.4","Summary"],"not_rendered":{"charts":0,"images":0,"macros":1,"external_links":0,"defined_names":5,"comments":0,"pivot_tables":0},"unopened":[],"bounds":{"document_bytes":16777216,"sheet_cells":100000,"rows_first":2000,"rows_last":500,"rows_between":2000,"halvings":0,"cell_chars":16384,"cell_head_chars":4096},"cells_cut":0,"cells_raw":0,"read":"whole","date_system":"1900"}

{"sheet":"Revisions","index":0,"n_rows":19,"n_cols":4,"rows_kept":19,"cut":false,"hidden":true,"merged":[]}
[]
["Change","Question","Description"]
[1,"All","Changed the question numbering to simplify",2016]
[2,null,"Updated agency changes",2016]
[3,null,"Added the certification statement to the bottom of the signature page",2016]
[4,null,"Updated instructions",2016]
[5,null,"Updated Signature Page",2016]
[6,null,"Add fair value information to 3.01.3",2016]
[7,null,"Updated Summary tab",2016]
[8,null,"Changed year on Signature Page"]
[9,null,"Changed 3.01.1 to read CASH (PETTY CASH) ON HAND REPORTING FORM"]
[10,null,"Changed form names 3.01.3 and 3.01.4 to 3.01.4 and 3.01.5 respectively.","??"]
[11]
[12]
[13]
[14]
[15]
[16]
[17]

{"sheet":"Yearly Data","index":1,"n_rows":87,"n_cols":3,"rows_kept":87,"cut":false,"hidden":true,"merged":[]}
["Year",2019]
[]
[]
["The following information must be reviewed and updated as necessary anually:"]
[]
["AGCY  CODE","AGENCY NAME","FY Added"]
["A010","LEGISLATIVE DEPARTMENT - THE SENATE"]
["A050","LEGISLATIVE DEPARTMENT - HOUSE OF REPRESENTATIVES"]
["A150","LEGISLATIVE DEPARTMENT - CODIFICATION OF LAWS & LEGISLATIVE COUNCIL"]
["A170","LEGISLATIVE DEPARTMENT - LEGISLATIVE SERVICES AGENCY"]
["A200","LEGISLATIVE DEPARTMENT - LEGISLATIVE AUDIT COUNCIL"]
["A850","EDUCATION OVERSIGHT COMMITTEE"]
["B040","JUDICIAL DEPARTMENT"]
["C050","ADMINISTRATIVE LAW JUDGES"]
["D050","GOVERNOR'S OFFICE--EXECUTIVE CONTROL OF STATE"]
["D100","GOVERNOR'S OFFICE--STATE LAW ENFORCEMENT DIVISION"]
["D170","GOVERNOR'S OFFICE-- EXECUTIVE POLICY & PROGRAMS"]
["D200","GOVERNOR'S OFFICE--MANSION & GROUNDS"]
["D250","INSPECTOR GENERAL"]
["D500","DEPARTMENT OF ADMINSTRATION"]
["E040","LIEUTENANT GOVERNOR'S OFFICE"]
["E080","SECRETARY OF STATE'S OFFICE"]
["E120","COMPTROLLER GENERAL'S OFFICE\n"]
["E160","STATE TREASURER'S OFFICE                                                                       "]
["E190","RETIREMENT SYSTEM  INVESTMENT COMMISSION"]
["E200","ATTORNEY GENERAL'S OFFICE"]
["E210","PROSECUTION COORDINATION  COMMISSION"]
["E230","COMMISSION ON INDIGENT DEFENSE "]
["E240","ADJUTANT GENERAL'S OFFICE"]
["E280","ELECTION COMMISSION"]
["E500","REVENUE AND FISCAL AFFAIRS OFFICE"]
["E550","STATE FISCAL ACCOUNTABILITY AUTHORITY"]
["F030","BUDGET & CONTROL BOARD       \n    \n"]
["F270","STATE AUDITOR"]
["H030","COMMISSION ON HIGHER EDUCATION"]
["H060","HIGHER EDUCATION TUITION GRANTS COMMISSION"]
["H590","BOARD FOR TECHNICAL & COMPREHENSIVE EDUCATION"]
["H630","DEPARTMENT OF EDUCATION"]
["H670","EDUCATIONAL TELEVISION COMMISSION (ETV)"]
["H710","WIL LOU GRAY OPPORTUNITY SCHOOL"]
["H730","VOCATIONAL REHABILITATION"]
["H750","SCHOOL FOR THE DEAF AND BLIND"]
["H790","DEPARTMENT OF ARCHIVES AND HISTORY"]
["H870","STATE LIBRARY"]
["H910","ARTS COMMISSION"]
["H950","MUSEUM COMMISSION"]
["H960","CONFEDERATE RELIC ROOM AND MILITARY MUSEUM COMMISSION"]
["J020","DEPARTMENT OF HEALTH AND HUMAN SERVICES"]
["J040","DEPARTMENT OF HEALTH AND ENVIRONMENTAL CONTROL"]
["J120","DEPARTMENT OF MENTAL HEALTH"]
["J160","DEPARTMENT OF DISABILITIES AND SPECIAL NEEDS"]
["J200","DEPARTMENT OF ALCOHOL AND OTHER DRUG ABUSE SERVICES"]
["K050","DEPARTMENT OF PUBLIC SAFETY"]
["L040","DEPARTMENT OF SOCIAL SERVICES"]
["L060","DIVISION ON AGING",2019]
["L080","CHILDREN'S ADVOCACY",2019]
["L120","JOHN DE LA HOWE SCHOOL"]
["L240","COMMISSION FOR THE BLIND"]
["L360","HUMAN AFFAIRS COMMISSION"]
["L460","STATE COMMISSION FOR MINORITY AFFAIRS"]
["N040","DEPARTMENT OF CORRECTIONS"]
["N080","DEPARTMENT OF PROBATION, PAROLE AND PARDON"]
["N120","DEPARTMENT OF JUVENILE JUSTICE"]
["N200","LAW ENFORCEMENT TRAINING COUNCIL"]
["P120","FORESTRY COMMISSION"]
["P160","DEPARTMENT OF AGRICULTURE"]
["P240","DEPARTMENT OF NATURAL RESOURCES"]
["P260","SEA GRANT CONSORTIUM"]
["P280","DEPARTMENT OF PARKS, RECREATION AND TOURISM"]
["P320","DEPARTMENT OF COMMERCE"]
["P400","SOUTH CAROLINA CONSERVATION BANK"]
["P450","RURAL INFASTRUCTURE AUTHORITY"]
["R040","PUBLIC SERVICE COMMISSION"]
["R060","OFFICE OF REGULATORY STAFF"]
["R080","WORKER'S COMPENSATION COMMISSION"]
["R160","SECOND INJURY FUND"]
["R200","DEPARTMENT OF INSURANCE"]
["R230","BOARD OF FINANCIAL INSTITUTIONS"]
["R280","DEPARTMENT OF CONSUMER AFFAIRS"]
["R360","DEPARTMENT OF LABOR, LICENSING, AND REGULATION"]
["R400","DEPARTMENT OF MOTOR VEHICLES"]
["R440","DEPARTMENT OF REVENUE AND TAXATION"]
["R520","STATE ETHICS COMMISSION"]
["R600","DEPARTMENT OF EMPLOYMENT WORKFORCE"]
["S600","PROCUREMENT REVIEW PANEL"]
["U300","AERONAUTICS DIVISION"]
["X440","AID TO SUBDIVISIONS--DEPARTMENT OF REVENUE   (Note 2)"]

{"sheet":"Instructions","index":2,"n_rows":75,"n_cols":10,"rows_kept":75,"cut":false,"hidden":false,"merged":[]}
["STATE OF SOUTH CAROLINA"]
["YEAR-END REPORTING PROCEDURES MANUAL"]
["SECTION 3.01, CASH AND INVESTMENTS REPORTING PACKAGE"]
[]
[null,"PURPOSE and OBJECTIVE:"]
[null,"The amount of cash and investments reported in the financial statements of the State is an important "]
[null,"measure of the State's financial soundness.  This reporting package is designed to gather"]
[null,"information regarding the types of cash and investments owned by the agencies essential for "]
[null,"accurate and complete reporting."]
[]
[null,"Please refer to the Reporting Procedure Manual for concepts and definitions related to this section"]
[null,"of the reporting forms."]
[]
[null,"If there is a question about whether a balance under the agency's management should be included, "]
[null,"call the Statewide Financial Reporting Division of the Comptroller General's Office for guidance.  "]
[null,"It is important that all of the agency's assets be included in the Statewide CAFR."]
[]
[null,"INSTRUCTIONS FOR THE COMPLETION OF THE FORMS"]
[]
[null,"Select your agency from the drop down box on tab Signature Page.  The selection will populate the agency code "]
[null,"and name to the appropriate places throughout the workbook."]
[null,"Complete each section based on the results from the Master Reporting Package. Upon completion"]
[null,"and review of the required sections of this package, save the excel file for your records, send an Excel"]
[null,"copy of the file to CAFR@cg.sc.gov.  Any required documentation required based on the completion"]
[null,"of this package should be scanned and e-mailed to the above address as well."]
[null,"Signature Page"]
[null,"Please type the name of the preparer and reviewer, their titles, e-mail address', phone numbers and date "]
[null,"completed in the section below the agency code and agency name.  If there are more than one preparer"]
[null,"or reviewer, include each additional preparer or reviewer on the same line."]
[null,"Cash on Hand Reporting Form",null,null,null,null,null,null,null,"3.01.1"]
[null,"Deposits with Bank Reporting Form",null,null,null,null,null,null,null,"3.01.2"]
[null,"Investments in Marketable Securities Reporting Form",null,null,null,null,null,null,null,"3.01.3"]
[null,"● Enter the information requested by the descriptions of each field."]
[null,"○   Definitions of fields to assist with preparation:"]
[null,"►    Fund - The 8 digit fund number found in SCEIS"]
[null,"►    SCEIS GL No - The 10 digit general ledger account number found in SCEIS"]
[null,"►    Recorded Balance - The ending balance of the account as recorded in SCEIS"]
[null,"►    Reconciled Balance - The final adjusted balance after reconciling between SCEIS, or other accounting system, and the "]
[null,null,null,"Bank Statement."]
[null,"►    Bank Statement Balance - The ending balance are reported by the bank"]
[null,"►    CUSIP/Ticker - The unique name used to identify stocks/bonds/investments/etc. that can be publically traded"]
[null,"►    Type of Investment - identifies the classification of the investment owned by the agency:  Stock - equity "]
[null,null,null,"investment/ownership, Bond - indenture/debt, Mutual Fund - combinations of stocks, bonds and other "]
[null,null,null,"investments, and Other - investments not classified as a Stock, Bond or Mutual Fund"]
[null,"►    Credit Rating - the rating given by an independent rating agency that identifies the quality and riskiness of the investment"]
[null,"►    Fair Value Determination - the method used to determine the fair value of the investment.  Market Price is the direct "]
[null,null,null,"quotes for the investment instrument in the open market.  Comparable price is the use of other investment values "]
[null,null,null,"that are similar to investment listed to arrive at a fair value.  Other is any other method used to determine the fair "]
[null,null,null,"value of the investment."]
[null,"○   Features within each form to assist in completion include:"]
[null,"►    Additional instructions for acceptable data input are provided as floating comments."]
[null,"►    Drop-down menu selections are available in many of the fields which require responses."]
[null,"►    Responses to Yes/No questions are provided as drop-down menu selection."]
[null,"►    Specific instructions may appear based on the responses to questions.  Please pay attention "]
[null,"to instructions provided. "]
[null,"● When required by the instructions in the form, supporting documentation should be submitted with "]
[null,"the reporting form."]
[null,"● Additional copies of the form may be created to provide complete information for the agency."]
[null,"Upon completion of the information requested:"]
[null,"● The individual completing the form should review the form for accuracy and completeness. "]
[null,"● The Finance Director or Executive Director should review the completed Form for completeness and accuracy."]
[null,"● Email the completed form to the Comptroller General's Office no later than July 19."]
[null,"● The agency should retain a copy of the completed form as part of its year-end working papers.  The "]
[null,"Comptroller General's Office will contact the individual completing the form if there are any "]
[null,"questions. "]
[]
[null,"Reviewer's Checklist",null,null,null,null,null,null,null,"3.01.4"]
[null,"Use this Checklist as a mechanism for review.  It should be completed prior to reviewer's signature on"]
[null,"the information forms.  A No response indicates an error.  If errors are identified, return the package"]
[null,"to the preparer for correction prior to further review.  Written explanation should be retained for "]
[null,"an N/A responses for review by auditors to ensure compliance with reporting requirements."]
[null,"Upon completion of the checklist:"]
[null,"● Email the completed form to the Comptroller General's Office no later than July 19."]
[null,"● Retain this form in the accounting records of the agency as documentation of the control procedure."]
[null,"● An auditor may request to examine the completed document."]

{"sheet":"Signature Page","index":3,"n_rows":46,"n_cols":6,"rows_kept":46,"cut":false,"hidden":false,"merged":[[45,1,45,5],[31,3,31,4],[37,1,37,5],[39,1,39,5],[41,1,41,5],[43,1,43,5]]}
[null,null,"CASH AND INVESTMENTS REPORTING PACKAGE SIGNATURE PAGE"]
[]
[]
[null,null,"CAFR Reporting Period:",null,{"$f":"Year","v":2019}]
[null,null,"Agency Number:",null,null,"*"]
[null,null,"Agency Name",null,{"$f":"IF(ISERROR(VLOOKUP(AgencyCode,'Yearly Data'!A7:B87,2,FALSE))=TRUE,\"\",VLOOKUP(AgencyCode,'Yearly Data'!A7:B87,2,FALSE))","v":""}]
[]
[]
[]
[null,null,null,null,"Before completing this package, please answer the following questions."]
[null,null,null,null,"Is form 3.01.1 required based on the Master Reporting Package?"]
[null,null,null,null,"Is form 3.01.2 required based on the Master Reporting Package?"]
[null,null,null,null,"Is form 3.01.3 required based on the Master Reporting Package?"]
[]
[null,null,"Preparer","Date:",null,"*"]
[null,null,null,"Name:",null,"*"]
[null,null,null,"Title:",null,"*"]
[null,null,null,"e-mail:",null,"*"]
[null,null,null,"Phone Number:",null,"*"]
[null,null,null,"Signature:",null,"*"]
[]
[null,null,{"$f":"IF('3.01.4'!C46=TRUE,\"The review of the closing package is incomplete.\",\"\")","v":"The review of the closing package is incomplete."}]
[null,null,"Reviewer","Date:",null,"*"]
[null,null,null,"Name:",null,"*"]
[null,null,null,"Title:",null,"*"]
[null,null,null,"e-mail:",null,"*"]
[null,null,null,"Phone Number:",null,"*"]
[null,null,null,"Signature:",null,"*"]
[]
[null,null,"Signatures are an assertion of the accuracy and completeness of the information reported.  "]
[]
[null,null,"*","Please complete the above page where indicated by a red star."]
[]
["Your signature on this form certifies that the information provided on the reporting packages is complete and accurate to the best of your knowledge."]
[]
["Representations made by signing as the approver:"]
[]
[null,"I acknowledge and have fulfilled the responsibility for implementation and maintenance of internal control relevant to the preparation and fair presentation of the year end packets that are free from material misstatement, whether due to fraud or error."]
[]
[null,"We have recorded or disclosed all accounting estimates that could be material to the financial statements in accordance with the requirements of U.S. GAAP. "]
[]
[null,"All events occurring subsequent to the date of the financial statements and for which U.S. GAAP requires adjustment or disclosure have been adjusted or disclosed."]
[]
[null," Special and extraordinary items have been appropriately classified and reported."]
[]
[null," The agency has no transfers, reservations or designations of fund equity or interfund borrowings that were not properly authorized and approved, or uncollectible interfund loans that have not been properly reflected in the reporting packets or disclosed to you."]

{"sheet":"3.01.1","index":4,"n_rows":183,"n_cols":5,"rows_kept":183,"cut":false,"hidden":false,"merged":[[0,0,0,4],[1,0,1,4],[2,0,2,4],[59,0,61,2],[23,1,23,3],[19,1,19,3],[9,1,9,3],[17,1,17,3],[21,1,21,3],[5,2,5,4],[6,2,6,4],[11,1,15,3]]}
["STATE OF SOUTH CAROLINA"]
["CASH ON HAND/PETTY CASH REPORTING FORM"]
[{"$f":"IF(Year=\"\",\"At June 30, \",\"At June 30, \"&Year)","v":"At June 30, 2019"}]
[]
[]
["Agency:",{"$f":"IF(AgencyCode=\"\",\"\",AgencyCode)","v":""},{"$f":"IF(AgencyName=\"\",\"Please choose your agency number on the Signature Page form.\",AgencyName)","v":"Please choose your agency number on the Signature Page form."}]
[null,"Business Area","Name"]
[]
[]
["1.","Was any portion of your authorized cash on hand/petty cash relinquished or surrendered during the year?"]
[]
[null,{"$f":"IF(E10=\"Yes\",\"Attach a memo to this package describing the reasons for the elimination.  Include documentation of the transaction utilized to record the decrease in this cash general ledger account and increase in the other.\",\"\")","v":""}]
[]
[]
[]
[]
[]
["2.","Provide the date that the cash on hand was last counted and/or replenished?"]
[]
[null,{"$f":"IF(B6=\"\",\"\",IF(E18=\"\",\"If you agency has petty cash, please enter a date.\",IF(E18<VALUE(\"6/1/\"&Year),\"Attach explanation for lack of timely oversight.\",\"\")))","v":""}]
[]
["3.","Does the report provided by the Comptroller General's Office properly reflect the balance for your cash on hand/ petty cash?"]
[]
[null,{"$f":"IF(B6=\"\",\"\",IF(E22=\"\",\"Please answer question 3.\",IF(E22=\"No\",\"Please identify the incorrect balance (by accounting fund) and provide the additional information requested below:\",\"\")))","v":""}]
[]
["Account #","Fund","Explanation of the difference identified:","Reconciled Balance","Last date counted"]
["01"]
["02"]
["03"]
["04"]
["05"]
["06"]
["07"]
["08"]
["09"]
["10"]
["11"]
["12"]
["13"]
["14"]
["15"]
["16"]
["17"]
["18"]
["19"]
["20"]
["21"]
["22"]
["23"]
["24"]
["25"]
["26"]
["27"]
["28"]
["29"]
["30"]
["31"]
["32"]
[]
["If additional space is needed to report other differences identified, please unhide additional rows by clicking the follwing button."]
[]
[null,null,null,"SET MACRO'S TO ENABLE "]
[]
[]
[]
[null,"The following information must be reviewed and updated as necessary anually:"]
[]
[null,"AGCY  CODE"]
[null,"A01"]
[null,"A05"]
[null,"A15"]
[null,"A17"]
[null,"A20"]
[null,"A85"]
[null,"B04"]
[null,"C05"]
[null,"D05"]
[null,"D10"]
[null,"D17"]
[null,"D20"]
[null,"D25"]
[null,"E04"]
[null,"E08"]
[null,"E12"]
[null,"E16"]
[null,"E19"]
[null,"E20"]
[null,"E21"]
[null,"E23"]
[null,"E24"]
[null,"E28"]
[null,"F03"]
[null,"F27"]
[null,"F29"]
[null,"F30"]
[null,"F31"]
[null,"F35"]
[null,"F50"]
[null,"H03"]
[null,"H06"]
[null,"H09"]
[null,"H12"]
[null,"H15"]
[null,"H17"]
[null,"H18"]
[null,"H21"]
[null,"H24"]
[null,"H27"]
[null,"H29"]
[null,"H34"]
[null,"H36"]
[null,"H37"]
[null,"H38"]
[null,"H39"]
[null,"H40"]
[null,"H47"]
[null,"H51"]
[null,"H59"]
[null,"H63"]
[null,"H67"]
[null,"H71"]
[null,"H73"]
[null,"H75"]
[null,"H79"]
[null,"H87"]
[null,"H91"]
[null,"H95"]
[null,"J02"]
[null,"J04"]
[null,"J12"]
[null,"J16"]
[null,"J20"]
[null,"K05"]
[null,"L04"]
[null,"L12"]
[null,"L24"]
[null,"L32"]
[null,"L36"]
[null,"L46"]
[null,"N04"]
[null,"N08"]
[null,"N12"]
[null,"N20"]
[null,"P12"]
[null,"P16"]
[null,"P20"]
[null,"P21"]
[null,"P24"]
[null,"P26"]
[null,"P28"]
[null,"P32"]
[null,"P34"]
[null,"P35"]
[null,"P36"]
[null,"P38"]
[null,"P40"]
[null,"P45"]
[null,"R04"]
[null,"R06"]
[null,"R08"]
[null,"R12"]
[null,"R14"]
[null,"R16"]
[null,"R20"]
[null,"R23"]
[null,"R28"]
[null,"R36"]
[null,"R40"]
[null,"R44"]
[null,"R52"]
[null,"R60"]
[null,"S60"]
[null,"U12"]
[null,"U30"]
[null,"V04"]
[null,"W90"]
[null,"X12"]
[null,"X22"]
[null,"X44"]
[null,"Y08"]
[null,"Y14"]
[null,"Y18"]
[null,"Y20"]

{"sheet":"3.01.2","index":5,"n_rows":102,"n_cols":10,"rows_kept":102,"cut":false,"hidden":false,"merged":[[7,1,7,6],[5,3,5,8],[82,1,84,5],[0,0,0,10],[1,0,1,10],[2,0,2,10]]}
["STATE OF SOUTH CAROLINA"]
["DEPOSITS WITH BANKS REPORTING FORM"]
[{"$f":"IF(Year=\"\",\"At June 30, \",\"At June 30, \"&Year)","v":"At June 30, 2019"}]
[]
[]
["Agency:",null,{"$f":"IF(AgencyCode=\"\",\"\",AgencyCode)","v":""},{"$f":"IF(AgencyName=\"\",\"Please choose your agency number on the Signature Page form.\",AgencyName)","v":"Please choose your agency number on the Signature Page form."}]
[null,null,"Business Area","Agency Name"]
[]
[null,"Complete the following information for each bank account owned by the agency.  Include composite accounts owned by the agency."]
["Bank Account #","In SCEIS?","SCEIS GL No","Fund","Recorded Balance","Reconciled Balance","Bank Statement Balance","Eval","Bank Name","Bank Acct No"]
[]
["01",null,null,null,null,null,null,{"$f":"IF(B12=\"\",\"\",IF(B12=\"No\",\"A\",IF(E12<>F12,\"B\",IF(D12=\"\",\"C\",\"D\"))))","v":""}]
["02",null,null,null,null,null,null,{"$f":"IF(B13=\"\",\"\",IF(B13=\"No\",\"A\",IF(E13<>F13,\"B\",IF(OR(D13=\"\",ISERROR(VALUE(LEFT(D13,1))),VALUE(LEFT(D13,1))>6),\"C\",\"D\"))))","v":""}]
["03",null,null,null,null,null,null,""]
["04",null,null,null,null,null,null,""]
["05",null,null,null,null,null,null,""]
["06",null,null,null,null,null,null,""]
["07",null,null,null,null,null,null,""]
["08",null,null,null,null,null,null,""]
["09",null,null,null,null,null,null,""]
["10",null,null,null,null,null,null,""]
["11",null,null,null,null,null,null,""]
["12",null,null,null,null,null,null,""]
["13",null,null,null,null,null,null,""]
["14",null,null,null,null,null,null,""]
["15",null,null,null,null,null,null,""]
["16",null,null,null,null,null,null,""]
["17",null,null,null,null,null,null,""]
["18",null,null,null,null,null,null,""]
["19",null,null,null,null,null,null,""]
["20",null,null,null,null,null,null,""]
["21",null,null,null,null,null,null,""]
["22",null,null,null,null,null,null,""]
["23",null,null,null,null,null,null,""]
["24",null,null,null,null,null,null,""]
["25",null,null,null,null,null,null,""]
["26",null,null,null,null,null,null,""]
["27",null,null,null,null,null,null,""]
["28",null,null,null,null,null,null,""]
["29",null,null,null,null,null,null,""]
["30",null,null,null,null,null,null,""]
["31",null,null,null,null,null,null,""]
["32",null,null,null,null,null,null,""]
["33",null,null,null,null,null,null,""]
["34",null,null,null,null,null,null,{"$f":"IF(B45=\"\",\"\",IF(B45=\"No\",\"A\",IF(E45<>F45,\"B\",IF(OR(D45=\"\",ISERROR(VALUE(LEFT(D45,1))),VALUE(LEFT(D45,1))>6),\"C\",\"D\"))))","v":""}]
["35",null,null,null,null,null,null,""]
["36",null,null,null,null,null,null,""]
["37",null,null,null,null,null,null,""]
["38",null,null,null,null,null,null,""]
["39",null,null,null,null,null,null,""]
["40",null,null,null,null,null,null,""]
["41",null,null,null,null,null,null,""]
["42",null,null,null,null,null,null,""]
["43",null,null,null,null,null,null,""]
["44",null,null,null,null,null,null,""]
["45",null,null,null,null,null,null,""]
["46",null,null,null,null,null,null,""]
["47",null,null,null,null,null,null,""]
["48",null,null,null,null,null,null,""]
["49",null,null,null,null,null,null,""]
["50",null,null,null,null,null,null,""]
["51",null,null,null,null,null,null,""]
["52",null,null,null,null,null,null,""]
["53",null,null,null,null,null,null,""]
["54",null,null,null,null,null,null,""]
["55",null,null,null,null,null,null,""]
["56",null,null,null,null,null,null,""]
["57",null,null,null,null,null,null,""]
["58",null,null,null,null,null,null,""]
["59",null,null,null,null,null,null,""]
["60",null,null,null,null,null,null,""]
["61",null,null,null,null,null,null,""]
["62",null,null,null,null,null,null,""]
["63",null,null,null,null,null,null,""]
["64",null,null,null,null,null,null,""]
["65",null,null,null,null,null,null,""]
["66",null,null,null,null,null,null,""]
["67",null,null,null,null,null,null,""]
["68",null,null,null,null,null,null,""]
["69",null,null,null,null,null,null,""]
["70",null,null,null,null,null,null,""]
[]
[null,"If additional accounts are required to be reported, please unhide additional rows by clicking the following button."]
[]
[]
[null,null,null,null,null,null,null,"SET MACRO'S TO ENABLE "]
[]
[null,"ADDITIONAL PROCEDURES REQUIRED BASED ON ANALYSIS EVALUATION (COLUMN EVAL):"]
[]
[null,"A.  Account is not reflected in SCEIS.",null,null,null,"B.  Recorded Balance not equal to Reconciled.",null,null,"C.  Fund Number not Provided","D.  No Additional"]
[null,"(1) a copy of the bank statement, ",null,null,null,"(1) a copy of the bank statement, ",null,null,"(1) a written description of the","procedures "]
[null,"(2) a copy of the year-end reconciliation, and ",null,null,null,"(2) a copy of the year-end reconciliation, and ",null,null,"activity flowing in the ","required."]
[null,"(3) a written explanation of why the account is not ",null,null,null,"(3) a written explanation of why the general ledger ",null,null,"account and how this activity "]
[null,"recorded in the agency's general ledger.  ",null,null,null,"was not adjusted to reconciled balance. ",null,null,"is reflected in the general ledger."]
[]
[]
[]
["(1) a copy of the bank statement, ",null,null,null,null,null,null,"A&B"]
["(2) a copy of the year-end reconciliation, and ",null,null,null,null,null,null,"A&B"]
["(3) a written explanation of why the account is not recorded in the agency's general ledger.  ",null,null,null,null,null,null,"A"]
["(4) a written explanation of why the general ledger was not adjusted to reconciled balance. ",null,null,null,null,null,null,"B"]
["(5) a written description of the activity flowing in the account and how this activity is reflected in the general ledger."]

{"sheet":"3.01.3","index":6,"n_rows":65,"n_cols":14,"rows_kept":65,"cut":false,"hidden":false,"merged":[[9,7,11,9],[5,2,5,7],[0,0,0,14],[1,0,1,14],[2,0,2,14]]}
["STATE OF SOUTH CAROLINA"]
["INVESTMENTS IN MARKETABLE SECURITIES REPORTING FORM"]
[{"$f":"IF(Year=\"\",\"At June 30, \",\"At June 30, \"&Year)","v":"At June 30, 2019"}]
[]
[]
["Agency:",{"$f":"IF(AgencyCode=\"\",\"\",AgencyCode)","v":""},{"$f":"IF(AgencyName=\"\",\"Please choose your agency number on the Signature Page form.\",AgencyName)","v":"Please choose your agency number on the Signature Page form."}]
[null,"Business Area","Name"]
[]
[]
[null,"Does the report provided by the Comptroller General's Office properly ",null,null,null,null,null,{"$f":"IF(G11=\"\",\"\",IF(G11=\"No\",\"Provide below appropriate offset for recording difference.\",\"\"))","v":""}]
[null,"reflect the balance(s) for investments owned (at fair value)?"]
[]
[]
[null,"Please provide the following, if additional space is required, an attachment may be submitted in lieu (please indicate See Attached in the Asset Name field)."]
[]
["Investment Number","CUSIP/Ticker","Asset Name"," Type of Security","Credit Rating","Is the fair value of the asset determined by market quotations?","SCEIS GL No","Fund","Program Name or Use of Assets","Recorded Value","Eval","Fair value 6/30","How was fair value determination made","Review Notes"]
["01",null,null,null,null,null,null,null,null,null,{"$f":"IF(L17=\"\",\"\",IF(H17=\"\",\"A\",IF(G17=\"\",\"B\",IF(L17<>J17,\"C\",\"D\"))))","v":""},null,null,{"$f":"IF(AND(D17=\"\",F17=\"\",G17=\"\",H17=\"\",J17=\"\",L17=\"\",M17=\"\")=TRUE,\"\",IF(OR(D17=\"\",F17=\"\",G17=\"\",H17=\"\",J17=\"\",L17=\"\",M17=\"\")=TRUE,\"Please complete remaining sections.\",\"\"))","v":""}]
["02",null,null,null,null,null,null,null,null,null,{"$f":"IF(L18=\"\",\"\",IF(H18=\"\",\"A\",IF(G18=\"\",\"B\",IF(L18<>J18,\"C\",\"D\"))))","v":""},null,null,{"$f":"IF(AND(D18=\"\",F18=\"\",G18=\"\",H18=\"\",J18=\"\",L18=\"\",M18=\"\")=TRUE,\"\",IF(OR(D18=\"\",F18=\"\",G18=\"\",H18=\"\",J18=\"\",L18=\"\",M18=\"\")=TRUE,\"Please complete remaining sections.\",\"\"))","v":""}]
["03",null,null,null,null,null,null,null,null,null,{"$f":"IF(L19=\"\",\"\",IF(H19=\"\",\"A\",IF(G19=\"\",\"B\",IF(L19<>J19,\"C\",\"D\"))))","v":""},null,null,""]
["04",null,null,null,null,null,null,null,null,null,{"$f":"IF(L20=\"\",\"\",IF(H20=\"\",\"A\",IF(OR(G20=\"\",ISERROR(VALUE(LEFT(G20,1))),VALUE(LEFT(G20,1))>1),\"B\",IF(L20<>J20,\"C\",\"D\"))))","v":""},null,null,""]
["05",null,null,null,null,null,null,null,null,null,"",null,null,""]
["06",null,null,null,null,null,null,null,null,null,"",null,null,""]
["07",null,null,null,null,null,null,null,null,null,"",null,null,""]
["08",null,null,null,null,null,null,null,null,null,"",null,null,""]
["09",null,null,null,null,null,null,null,null,null,"",null,null,""]
["10",null,null,null,null,null,null,null,null,null,"",null,null,""]
["11",null,null,null,null,null,null,null,null,null,"",null,null,""]
["12",null,null,null,null,null,null,null,null,null,"",null,null,""]
["13",null,null,null,null,null,null,null,null,null,"",null,null,""]
["14",null,null,null,null,null,null,null,null,null,"",null,null,""]
["15",null,null,null,null,null,null,null,null,null,"",null,null,""]
["16",null,null,null,null,null,null,null,null,null,"",null,null,""]
["17",null,null,null,null,null,null,null,null,null,"",null,null,""]
["18",null,null,null,null,null,null,null,null,null,"",null,null,""]
["19",null,null,null,null,null,null,null,null,null,"",null,null,""]
["20",null,null,null,null,null,null,null,null,null,"",null,null,""]
["21",null,null,null,null,null,null,null,null,null,"",null,null,""]
["22",null,null,null,null,null,null,null,null,null,"",null,null,""]
["23",null,null,null,null,null,null,null,null,null,"",null,null,""]
["24",null,null,null,null,null,null,null,null,null,"",null,null,""]
["25",null,null,null,null,null,null,null,null,null,"",null,null,""]
["26",null,null,null,null,null,null,null,null,null,"",null,null,""]
["27",null,null,null,null,null,null,null,null,null,"",null,null,""]
["28",null,null,null,null,null,null,null,null,null,"",null,null,""]
["29",null,null,null,null,null,null,null,null,null,"",null,null,""]
["30",null,null,null,null,null,null,null,null,null,"",null,null,""]
["31",null,null,null,null,null,null,null,null,null,"",null,null,""]
["32",null,null,null,null,null,null,null,null,null,"",null,null,""]
["33",null,null,null,null,null,null,null,null,null,"",null,null,""]
["34",null,null,null,null,null,null,null,null,null,"",null,null,""]
["35",null,null,null,null,null,null,null,null,null,"",null,null,""]
[]
[]
[]
[null,"ADDITIONAL PROCEDURES REQUIRED BASED ON ANALYSIS EVALUATION (COLUMN EVAL):"]
[null,"A.  Fund Number not Provided",null,"B.  Account is not reflected in SCEIS.",null,null,"C.  Recorded Balance not equal to Reconciled.",null,null,"D.  No Additional"]
[null,"(1) a written description of the",null,"(1) a copy of the Investment statement, ",null,null,"(1) a copy of the investment statement, ",null,null,"procedures "]
[null,"activity flowing in the ",null,"(2) a written explanation of why the ",null,null,"(2) a copy of the year-end reconciliation, and ",null,null,"required."]
[null,"account and how this activity ",null,"asset is not recorded in the agency's ",null,null,"(3) a written explanation of why the general ledger "]
[null,"is reflected in the general ledger.",null,"general ledger.  ",null,null,"was not adjusted to the year-end valuation. "]
[null,"(2) a copy of the Investment statement, "]
[null,"(3) a written explanation of why the "]
[null,"asset is not recorded in the agency's ",null,"NOTE: If additional accounts are required to be reported,"]
[null,"general ledger.  ",null,"unhide additional rows by clicking the following button."]
[null,null,null,null,null,null,null,null,null,"SET MACRO'S TO ENABLE "]

{"sheet":"3.01.4","index":7,"n_rows":46,"n_cols":3,"rows_kept":46,"cut":false,"hidden":false,"merged":[[3,0,3,3]]}
["STATE OF SOUTH CAROLINA"]
["CASH AND INVESTMENTS REPORTING PACKAGE"]
["REVIEWER CHECKLIST"]
[{"$f":"IF(Year=\"\",\"\",\"FISCAL YEAR \"&Year)","v":"FISCAL YEAR 2019"}]
[]
["Reviewed by:"]
[null,"Type Reviewer's Name"]
[null,"Date Last Review Step Was Completed:   "]
[]
["Instructions","Type the name of the person reviewing this closing package and the date of the review.  The reviewer should also answer each of the sixteen questions below.  All questions must be answered either \"Yes\", \"No\", or \"N/A\" for non applicable.  If a question is left blank the closing package will be rejected and returned."]
[]
[]
[{"$f":"COUNT(A$9:A9)+1","v":1},"Is the reviewer of the form someone other than the person who prepared it?"]
[]
[{"$f":"COUNT(A$9:A13)+1","v":2},"Does the signature page form contain the typed name of each preparer and reviewer?"]
[]
[3,"If the agency is live in SCEIS, have appropriate entries been made in SCEIS to agree the amounts reported to the agency's general ledger?"]
[]
[4,"Are the responses to the \"Does this part apply to this agency?\" appropriate and accurate?"]
[]
[5,"Has the agency refrained from completing sections that do not apply to it?"]
[]
[6,"Is supporting documentation retained by the agency for the amounts confirmed and reported?"]
[]
[7,"Are all cash on hand (petty cash, change funds, and other) accounts reported for your agency?"]
[]
[8,"Is the authorized balance (for cash on hand or petty cash) reported accurate?"]
[]
[9,"Are all bank accounts including composite reservior bank accounts applicable to your agency reported?"]
[]
[10,"Did you confirm the reconciled balance at June 30 as the reported book balance for these bank accounts?"]
[]
[11,"Did you report the bank balance for each book balance reported? "]
[]
[12,"Are all investments applicable to your agency that are not under the State Treasurer's direct control reported?"]
[]
[13,"Is information included about risk exposure related to the investments owned or held in trusts as of June 30?"]
[]
[14,"Did you refrain from reporting investments that are not available for sale, not owned by the State or not under the control of your agency?"]
[]
[15,"If you used something other than quoted market price information to establish the fair value of any investment, did you attach a separate page describing the method and significant assumptions used?"]
[]
[16,"Has the balances and activity reported been compared with the prior year, documenting causes for any large fluctuations that can be easily obtained and explained to individuals not familiar with the daily operations of the agency?"]
[]
[]
[null,null,{"$f":"OR(B6=\"\",C8=\"\",C13=\"\",C15=\"\",C17=\"\",C19=\"\",C21=\"\",C23=\"\",C25=\"\",C27=\"\",C29=\"\",C31=\"\",C33=\"\",C35=\"\",C37=\"\",C39=\"\",C41=\"\",C43=\"\")","v":true}]

{"sheet":"Summary","index":8,"n_rows":185,"n_cols":18,"rows_kept":185,"cut":false,"hidden":true,"merged":[]}
["Worksheet","Agnecy Code","Agency Name","Year","QUESTION",1,2,3,4,5,6,7,8,9,10,11,12]
["3.01.1",{"$f":"AgencyCode","v":0},{"$f":"AgencyName","v":""},{"$f":"Year","v":2019},{"$f":"'3.01.1'!A10","v":"1."},{"$f":"IF('3.01.1'!E10=\"\",\"\",'3.01.1'!E10)","v":""}]
["3.01.1",0,{"$f":"AgencyName","v":""},2019,"1.a",{"$f":"IF('3.01.1'!B12=\"\",\"\",'3.01.1'!B12)","v":""}]
["3.01.1",0,"",2019,{"$f":"'3.01.1'!A18","v":"2."},{"$f":"IF('3.01.1'!E18=\"\",\"\",'3.01.1'!E18)","v":""}]
["3.01.1",0,"",2019,"2.a",{"$f":"IF('3.01.1'!B20=\"\",\"\",'3.01.1'!B20)","v":""}]
["3.01.1",0,"",2019,{"$f":"'3.01.1'!A22","v":"3."},{"$f":"IF('3.01.1'!E22=\"\",\"\",'3.01.1'!E22)","v":""}]
["3.01.1",0,"",2019,"3.a",{"$f":"IF('3.01.1'!B24=\"\",\"\",'3.01.1'!B24)","v":""},{"$f":"IF('3.01.1'!D25=\"\",\"\",'3.01.1'!D25)","v":""},{"$f":"IF('3.01.1'!F25=\"\",\"\",'3.01.1'!F25)","v":""},{"$f":"IF('3.01.1'!H25=\"\",\"\",'3.01.1'!H25)","v":""}]
["3.01.1",0,"",2019,{"$f":"'3.01.1'!A27","v":"01"},{"$f":"IF('3.01.1'!B27=\"\",\"\",'3.01.1'!B27)","v":""},{"$f":"IF('3.01.1'!C27=\"\",\"\",'3.01.1'!C27)","v":""},{"$f":"IF('3.01.1'!D27=\"\",\"\",'3.01.1'!D27)","v":""},{"$f":"IF('3.01.1'!E27=\"\",\"\",'3.01.1'!E27)","v":""}]
["3.01.1",0,"",2019,{"$f":"'3.01.1'!A28","v":"02"},{"$f":"IF('3.01.1'!B28=\"\",\"\",'3.01.1'!B28)","v":""},{"$f":"IF('3.01.1'!C28=\"\",\"\",'3.01.1'!C28)","v":""},{"$f":"IF('3.01.1'!D28=\"\",\"\",'3.01.1'!D28)","v":""},{"$f":"IF('3.01.1'!E28=\"\",\"\",'3.01.1'!E28)","v":""}]
["3.01.1",0,"",2019,{"$f":"'3.01.1'!A29","v":"03"},{"$f":"IF('3.01.1'!B29=\"\",\"\",'3.01.1'!B29)","v":""},{"$f":"IF('3.01.1'!C29=\"\",\"\",'3.01.1'!C29)","v":""},{"$f":"IF('3.01.1'!D29=\"\",\"\",'3.01.1'!D29)","v":""},{"$f":"IF('3.01.1'!E29=\"\",\"\",'3.01.1'!E29)","v":""}]
["3.01.1",0,"",2019,{"$f":"'3.01.1'!A30","v":"04"},{"$f":"IF('3.01.1'!B30=\"\",\"\",'3.01.1'!B30)","v":""},{"$f":"IF('3.01.1'!C30=\"\",\"\",'3.01.1'!C30)","v":""},{"$f":"IF('3.01.1'!D30=\"\",\"\",'3.01.1'!D30)","v":""},{"$f":"IF('3.01.1'!E30=\"\",\"\",'3.01.1'!E30)","v":""}]
["3.01.1",0,"",2019,{"$f":"'3.01.1'!A31","v":"05"},{"$f":"IF('3.01.1'!B31=\"\",\"\",'3.01.1'!B31)","v":""},{"$f":"IF('3.01.1'!C31=\"\",\"\",'3.01.1'!C31)","v":""},{"$f":"IF('3.01.1'!D31=\"\",\"\",'3.01.1'!D31)","v":""},{"$f":"IF('3.01.1'!E31=\"\",\"\",'3.01.1'!E31)","v":""}]
["3.01.1",0,"",2019,{"$f":"'3.01.1'!A32","v":"06"},{"$f":"IF('3.01.1'!B32=\"\",\"\",'3.01.1'!B32)","v":""},{"$f":"IF('3.01.1'!C32=\"\",\"\",'3.01.1'!C32)","v":""},{"$f":"IF('3.01.1'!D32=\"\",\"\",'3.01.1'!D32)","v":""},{"$f":"IF('3.01.1'!E32=\"\",\"\",'3.01.1'!E32)","v":""}]
["3.01.1",0,"",2019,{"$f":"'3.01.1'!A33","v":"07"},{"$f":"IF('3.01.1'!B33=\"\",\"\",'3.01.1'!B33)","v":""},{"$f":"IF('3.01.1'!C33=\"\",\"\",'3.01.1'!C33)","v":""},{"$f":"IF('3.01.1'!D33=\"\",\"\",'3.01.1'!D33)","v":""},{"$f":"IF('3.01.1'!E33=\"\",\"\",'3.01.1'!E33)","v":""}]
["3.01.1",0,"",2019,{"$f":"'3.01.1'!A34","v":"08"},{"$f":"IF('3.01.1'!B34=\"\",\"\",'3.01.1'!B34)","v":""},{"$f":"IF('3.01.1'!C34=\"\",\"\",'3.01.1'!C34)","v":""},{"$f":"IF('3.01.1'!D34=\"\",\"\",'3.01.1'!D34)","v":""},{"$f":"IF('3.01.1'!E34=\"\",\"\",'3.01.1'!E34)","v":""}]
["3.01.1",0,"",2019,{"$f":"'3.01.1'!A35","v":"09"},{"$f":"IF('3.01.1'!B35=\"\",\"\",'3.01.1'!B35)","v":""},{"$f":"IF('3.01.1'!C35=\"\",\"\",'3.01.1'!C35)","v":""},{"$f":"IF('3.01.1'!D35=\"\",\"\",'3.01.1'!D35)","v":""},{"$f":"IF('3.01.1'!E35=\"\",\"\",'3.01.1'!E35)","v":""}]
["3.01.1",0,"",2019,{"$f":"'3.01.1'!A36","v":"10"},{"$f":"IF('3.01.1'!B36=\"\",\"\",'3.01.1'!B36)","v":""},{"$f":"IF('3.01.1'!C36=\"\",\"\",'3.01.1'!C36)","v":""},{"$f":"IF('3.01.1'!D36=\"\",\"\",'3.01.1'!D36)","v":""},{"$f":"IF('3.01.1'!E36=\"\",\"\",'3.01.1'!E36)","v":""}]
["3.01.1",0,"",2019,{"$f":"'3.01.1'!A37","v":"11"},{"$f":"IF('3.01.1'!B37=\"\",\"\",'3.01.1'!B37)","v":""},{"$f":"IF('3.01.1'!C37=\"\",\"\",'3.01.1'!C37)","v":""},{"$f":"IF('3.01.1'!D37=\"\",\"\",'3.01.1'!D37)","v":""},{"$f":"IF('3.01.1'!E37=\"\",\"\",'3.01.1'!E37)","v":""}]
["3.01.1",0,"",2019,{"$f":"'3.01.1'!A38","v":"12"},{"$f":"IF('3.01.1'!B38=\"\",\"\",'3.01.1'!B38)","v":""},{"$f":"IF('3.01.1'!C38=\"\",\"\",'3.01.1'!C38)","v":""},{"$f":"IF('3.01.1'!D38=\"\",\"\",'3.01.1'!D38)","v":""},{"$f":"IF('3.01.1'!E38=\"\",\"\",'3.01.1'!E38)","v":""}]
["3.01.1",0,"",2019,{"$f":"'3.01.1'!A39","v":"13"},{"$f":"IF('3.01.1'!B39=\"\",\"\",'3.01.1'!B39)","v":""},{"$f":"IF('3.01.1'!C39=\"\",\"\",'3.01.1'!C39)","v":""},{"$f":"IF('3.01.1'!D39=\"\",\"\",'3.01.1'!D39)","v":""},{"$f":"IF('3.01.1'!E39=\"\",\"\",'3.01.1'!E39)","v":""}]
["3.01.1",0,"",2019,{"$f":"'3.01.1'!A40","v":"14"},{"$f":"IF('3.01.1'!B40=\"\",\"\",'3.01.1'!B40)","v":""},{"$f":"IF('3.01.1'!C40=\"\",\"\",'3.01.1'!C40)","v":""},{"$f":"IF('3.01.1'!D40=\"\",\"\",'3.01.1'!D40)","v":""},{"$f":"IF('3.01.1'!E40=\"\",\"\",'3.01.1'!E40)","v":""}]
["3.01.1",0,"",2019,{"$f":"'3.01.1'!A41","v":"15"},{"$f":"IF('3.01.1'!B41=\"\",\"\",'3.01.1'!B41)","v":""},{"$f":"IF('3.01.1'!C41=\"\",\"\",'3.01.1'!C41)","v":""},{"$f":"IF('3.01.1'!D41=\"\",\"\",'3.01.1'!D41)","v":""},{"$f":"IF('3.01.1'!E41=\"\",\"\",'3.01.1'!E41)","v":""}]
["3.01.1",0,"",2019,{"$f":"'3.01.1'!A42","v":"16"},{"$f":"IF('3.01.1'!B42=\"\",\"\",'3.01.1'!B42)","v":""},{"$f":"IF('3.01.1'!C42=\"\",\"\",'3.01.1'!C42)","v":""},{"$f":"IF('3.01.1'!D42=\"\",\"\",'3.01.1'!D42)","v":""},{"$f":"IF('3.01.1'!E42=\"\",\"\",'3.01.1'!E42)","v":""}]
["3.01.1",0,"",2019,{"$f":"'3.01.1'!A43","v":"17"},{"$f":"IF('3.01.1'!B43=\"\",\"\",'3.01.1'!B43)","v":""},{"$f":"IF('3.01.1'!C43=\"\",\"\",'3.01.1'!C43)","v":""},{"$f":"IF('3.01.1'!D43=\"\",\"\",'3.01.1'!D43)","v":""},{"$f":"IF('3.01.1'!E43=\"\",\"\",'3.01.1'!E43)","v":""}]
["3.01.1",0,"",2019,{"$f":"'3.01.1'!A44","v":"18"},{"$f":"IF('3.01.1'!B44=\"\",\"\",'3.01.1'!B44)","v":""},{"$f":"IF('3.01.1'!C44=\"\",\"\",'3.01.1'!C44)","v":""},{"$f":"IF('3.01.1'!D44=\"\",\"\",'3.01.1'!D44)","v":""},{"$f":"IF('3.01.1'!E44=\"\",\"\",'3.01.1'!E44)","v":""}]
["3.01.1",0,"",2019,{"$f":"'3.01.1'!A45","v":"19"},{"$f":"IF('3.01.1'!B45=\"\",\"\",'3.01.1'!B45)","v":""},{"$f":"IF('3.01.1'!C45=\"\",\"\",'3.01.1'!C45)","v":""},{"$f":"IF('3.01.1'!D45=\"\",\"\",'3.01.1'!D45)","v":""},{"$f":"IF('3.01.1'!E45=\"\",\"\",'3.01.1'!E45)","v":""}]
["3.01.1",0,"",2019,{"$f":"'3.01.1'!A46","v":"20"},{"$f":"IF('3.01.1'!B46=\"\",\"\",'3.01.1'!B46)","v":""},{"$f":"IF('3.01.1'!C46=\"\",\"\",'3.01.1'!C46)","v":""},{"$f":"IF('3.01.1'!D46=\"\",\"\",'3.01.1'!D46)","v":""},{"$f":"IF('3.01.1'!E46=\"\",\"\",'3.01.1'!E46)","v":""}]
["3.01.1",0,"",2019,{"$f":"'3.01.1'!A47","v":"21"},{"$f":"IF('3.01.1'!B47=\"\",\"\",'3.01.1'!B47)","v":""},{"$f":"IF('3.01.1'!C47=\"\",\"\",'3.01.1'!C47)","v":""},{"$f":"IF('3.01.1'!D47=\"\",\"\",'3.01.1'!D47)","v":""},{"$f":"IF('3.01.1'!E47=\"\",\"\",'3.01.1'!E47)","v":""}]
["3.01.1",0,"",2019,{"$f":"'3.01.1'!A48","v":"22"},{"$f":"IF('3.01.1'!B48=\"\",\"\",'3.01.1'!B48)","v":""},{"$f":"IF('3.01.1'!C48=\"\",\"\",'3.01.1'!C48)","v":""},{"$f":"IF('3.01.1'!D48=\"\",\"\",'3.01.1'!D48)","v":""},{"$f":"IF('3.01.1'!E48=\"\",\"\",'3.01.1'!E48)","v":""}]
["3.01.1",0,"",2019,{"$f":"'3.01.1'!A49","v":"23"},{"$f":"IF('3.01.1'!B49=\"\",\"\",'3.01.1'!B49)","v":""},{"$f":"IF('3.01.1'!C49=\"\",\"\",'3.01.1'!C49)","v":""},{"$f":"IF('3.01.1'!D49=\"\",\"\",'3.01.1'!D49)","v":""},{"$f":"IF('3.01.1'!E49=\"\",\"\",'3.01.1'!E49)","v":""}]
["3.01.1",0,"",2019,{"$f":"'3.01.1'!A50","v":"24"},{"$f":"IF('3.01.1'!B50=\"\",\"\",'3.01.1'!B50)","v":""},{"$f":"IF('3.01.1'!C50=\"\",\"\",'3.01.1'!C50)","v":""},{"$f":"IF('3.01.1'!D50=\"\",\"\",'3.01.1'!D50)","v":""},{"$f":"IF('3.01.1'!E50=\"\",\"\",'3.01.1'!E50)","v":""}]
["3.01.1",0,"",2019,{"$f":"'3.01.1'!A51","v":"25"},{"$f":"IF('3.01.1'!B51=\"\",\"\",'3.01.1'!B51)","v":""},{"$f":"IF('3.01.1'!C51=\"\",\"\",'3.01.1'!C51)","v":""},{"$f":"IF('3.01.1'!D51=\"\",\"\",'3.01.1'!D51)","v":""},{"$f":"IF('3.01.1'!E51=\"\",\"\",'3.01.1'!E51)","v":""}]
["3.01.1",0,"",2019,{"$f":"'3.01.1'!A52","v":"26"},{"$f":"IF('3.01.1'!B52=\"\",\"\",'3.01.1'!B52)","v":""},{"$f":"IF('3.01.1'!C52=\"\",\"\",'3.01.1'!C52)","v":""},{"$f":"IF('3.01.1'!D52=\"\",\"\",'3.01.1'!D52)","v":""},{"$f":"IF('3.01.1'!E52=\"\",\"\",'3.01.1'!E52)","v":""}]
["3.01.1",0,"",2019,{"$f":"'3.01.1'!A53","v":"27"},{"$f":"IF('3.01.1'!B53=\"\",\"\",'3.01.1'!B53)","v":""},{"$f":"IF('3.01.1'!C53=\"\",\"\",'3.01.1'!C53)","v":""},{"$f":"IF('3.01.1'!D53=\"\",\"\",'3.01.1'!D53)","v":""},{"$f":"IF('3.01.1'!E53=\"\",\"\",'3.01.1'!E53)","v":""}]
["3.01.1",0,"",2019,{"$f":"'3.01.1'!A54","v":"28"},{"$f":"IF('3.01.1'!B54=\"\",\"\",'3.01.1'!B54)","v":""},{"$f":"IF('3.01.1'!C54=\"\",\"\",'3.01.1'!C54)","v":""},{"$f":"IF('3.01.1'!D54=\"\",\"\",'3.01.1'!D54)","v":""},{"$f":"IF('3.01.1'!E54=\"\",\"\",'3.01.1'!E54)","v":""}]
["3.01.1",0,"",2019,{"$f":"'3.01.1'!A55","v":"29"},{"$f":"IF('3.01.1'!B55=\"\",\"\",'3.01.1'!B55)","v":""},{"$f":"IF('3.01.1'!C55=\"\",\"\",'3.01.1'!C55)","v":""},{"$f":"IF('3.01.1'!D55=\"\",\"\",'3.01.1'!D55)","v":""},{"$f":"IF('3.01.1'!E55=\"\",\"\",'3.01.1'!E55)","v":""}]
["3.01.1",0,"",2019,{"$f":"'3.01.1'!A56","v":"30"},{"$f":"IF('3.01.1'!B56=\"\",\"\",'3.01.1'!B56)","v":""},{"$f":"IF('3.01.1'!C56=\"\",\"\",'3.01.1'!C56)","v":""},{"$f":"IF('3.01.1'!D56=\"\",\"\",'3.01.1'!D56)","v":""},{"$f":"IF('3.01.1'!E56=\"\",\"\",'3.01.1'!E56)","v":""}]
["3.01.1",0,"",2019,{"$f":"'3.01.1'!A57","v":"31"},{"$f":"IF('3.01.1'!B57=\"\",\"\",'3.01.1'!B57)","v":""},{"$f":"IF('3.01.1'!C57=\"\",\"\",'3.01.1'!C57)","v":""},{"$f":"IF('3.01.1'!D57=\"\",\"\",'3.01.1'!D57)","v":""},{"$f":"IF('3.01.1'!E57=\"\",\"\",'3.01.1'!E57)","v":""}]
["3.01.1",0,"",2019,{"$f":"'3.01.1'!A58","v":"32"},{"$f":"IF('3.01.1'!B58=\"\",\"\",'3.01.1'!B58)","v":""},{"$f":"IF('3.01.1'!C58=\"\",\"\",'3.01.1'!C58)","v":""},{"$f":"IF('3.01.1'!D58=\"\",\"\",'3.01.1'!D58)","v":""},{"$f":"IF('3.01.1'!E58=\"\",\"\",'3.01.1'!E58)","v":""}]
["3.01.2",0,"",2019,{"$f":"'3.01.2'!A12","v":"01"},{"$f":"IF('3.01.2'!B12=\"\",\"\",'3.01.2'!B12)","v":""},{"$f":"IF('3.01.2'!C12=\"\",\"\",'3.01.2'!C12)","v":""},{"$f":"IF('3.01.2'!D12=\"\",\"\",'3.01.2'!D12)","v":""},{"$f":"IF('3.01.2'!E12=\"\",\"\",'3.01.2'!E12)","v":""},{"$f":"IF('3.01.2'!F12=\"\",\"\",'3.01.2'!F12)","v":""},{"$f":"IF('3.01.2'!G12=\"\",\"\",'3.01.2'!G12)","v":""},{"$f":"IF('3.01.2'!H12=\"\",\"\",'3.01.2'!H12)","v":""},{"$f":"IF('3.01.2'!I12=\"\",\"\",'3.01.2'!I12)","v":""},{"$f":"IF('3.01.2'!J12=\"\",\"\",'3.01.2'!J12)","v":""}]
["3.01.2",0,"",2019,{"$f":"'3.01.2'!A13","v":"02"},{"$f":"IF('3.01.2'!B13=\"\",\"\",'3.01.2'!B13)","v":""},{"$f":"IF('3.01.2'!C13=\"\",\"\",'3.01.2'!C13)","v":""},{"$f":"IF('3.01.2'!D13=\"\",\"\",'3.01.2'!D13)","v":""},{"$f":"IF('3.01.2'!E13=\"\",\"\",'3.01.2'!E13)","v":""},{"$f":"IF('3.01.2'!F13=\"\",\"\",'3.01.2'!F13)","v":""},{"$f":"IF('3.01.2'!G13=\"\",\"\",'3.01.2'!G13)","v":""},{"$f":"IF('3.01.2'!H13=\"\",\"\",'3.01.2'!H13)","v":""},{"$f":"IF('3.01.2'!I13=\"\",\"\",'3.01.2'!I13)","v":""},{"$f":"IF('3.01.2'!J13=\"\",\"\",'3.01.2'!J13)","v":""}]
["3.01.2",0,"",2019,{"$f":"'3.01.2'!A14","v":"03"},{"$f":"IF('3.01.2'!B14=\"\",\"\",'3.01.2'!B14)","v":""},{"$f":"IF('3.01.2'!C14=\"\",\"\",'3.01.2'!C14)","v":""},{"$f":"IF('3.01.2'!D14=\"\",\"\",'3.01.2'!D14)","v":""},{"$f":"IF('3.01.2'!E14=\"\",\"\",'3.01.2'!E14)","v":""},{"$f":"IF('3.01.2'!F14=\"\",\"\",'3.01.2'!F14)","v":""},{"$f":"IF('3.01.2'!G14=\"\",\"\",'3.01.2'!G14)","v":""},{"$f":"IF('3.01.2'!H14=\"\",\"\",'3.01.2'!H14)","v":""},{"$f":"IF('3.01.2'!I14=\"\",\"\",'3.01.2'!I14)","v":""},{"$f":"IF('3.01.2'!J14=\"\",\"\",'3.01.2'!J14)","v":""}]
["3.01.2",0,"",2019,{"$f":"'3.01.2'!A15","v":"04"},{"$f":"IF('3.01.2'!B15=\"\",\"\",'3.01.2'!B15)","v":""},{"$f":"IF('3.01.2'!C15=\"\",\"\",'3.01.2'!C15)","v":""},{"$f":"IF('3.01.2'!D15=\"\",\"\",'3.01.2'!D15)","v":""},{"$f":"IF('3.01.2'!E15=\"\",\"\",'3.01.2'!E15)","v":""},{"$f":"IF('3.01.2'!F15=\"\",\"\",'3.01.2'!F15)","v":""},{"$f":"IF('3.01.2'!G15=\"\",\"\",'3.01.2'!G15)","v":""},{"$f":"IF('3.01.2'!H15=\"\",\"\",'3.01.2'!H15)","v":""},{"$f":"IF('3.01.2'!I15=\"\",\"\",'3.01.2'!I15)","v":""},{"$f":"IF('3.01.2'!J15=\"\",\"\",'3.01.2'!J15)","v":""}]
["3.01.2",0,"",2019,{"$f":"'3.01.2'!A16","v":"05"},{"$f":"IF('3.01.2'!B16=\"\",\"\",'3.01.2'!B16)","v":""},{"$f":"IF('3.01.2'!C16=\"\",\"\",'3.01.2'!C16)","v":""},{"$f":"IF('3.01.2'!D16=\"\",\"\",'3.01.2'!D16)","v":""},{"$f":"IF('3.01.2'!E16=\"\",\"\",'3.01.2'!E16)","v":""},{"$f":"IF('3.01.2'!F16=\"\",\"\",'3.01.2'!F16)","v":""},{"$f":"IF('3.01.2'!G16=\"\",\"\",'3.01.2'!G16)","v":""},{"$f":"IF('3.01.2'!H16=\"\",\"\",'3.01.2'!H16)","v":""},{"$f":"IF('3.01.2'!I16=\"\",\"\",'3.01.2'!I16)","v":""},{"$f":"IF('3.01.2'!J16=\"\",\"\",'3.01.2'!J16)","v":""}]
["3.01.2",0,"",2019,{"$f":"'3.01.2'!A17","v":"06"},{"$f":"IF('3.01.2'!B17=\"\",\"\",'3.01.2'!B17)","v":""},{"$f":"IF('3.01.2'!C17=\"\",\"\",'3.01.2'!C17)","v":""},{"$f":"IF('3.01.2'!D17=\"\",\"\",'3.01.2'!D17)","v":""},{"$f":"IF('3.01.2'!E17=\"\",\"\",'3.01.2'!E17)","v":""},{"$f":"IF('3.01.2'!F17=\"\",\"\",'3.01.2'!F17)","v":""},{"$f":"IF('3.01.2'!G17=\"\",\"\",'3.01.2'!G17)","v":""},{"$f":"IF('3.01.2'!H17=\"\",\"\",'3.01.2'!H17)","v":""},{"$f":"IF('3.01.2'!I17=\"\",\"\",'3.01.2'!I17)","v":""},{"$f":"IF('3.01.2'!J17=\"\",\"\",'3.01.2'!J17)","v":""}]
["3.01.2",0,"",2019,{"$f":"'3.01.2'!A18","v":"07"},{"$f":"IF('3.01.2'!B18=\"\",\"\",'3.01.2'!B18)","v":""},{"$f":"IF('3.01.2'!C18=\"\",\"\",'3.01.2'!C18)","v":""},{"$f":"IF('3.01.2'!D18=\"\",\"\",'3.01.2'!D18)","v":""},{"$f":"IF('3.01.2'!E18=\"\",\"\",'3.01.2'!E18)","v":""},{"$f":"IF('3.01.2'!F18=\"\",\"\",'3.01.2'!F18)","v":""},{"$f":"IF('3.01.2'!G18=\"\",\"\",'3.01.2'!G18)","v":""},{"$f":"IF('3.01.2'!H18=\"\",\"\",'3.01.2'!H18)","v":""},{"$f":"IF('3.01.2'!I18=\"\",\"\",'3.01.2'!I18)","v":""},{"$f":"IF('3.01.2'!J18=\"\",\"\",'3.01.2'!J18)","v":""}]
["3.01.2",0,"",2019,{"$f":"'3.01.2'!A19","v":"08"},{"$f":"IF('3.01.2'!B19=\"\",\"\",'3.01.2'!B19)","v":""},{"$f":"IF('3.01.2'!C19=\"\",\"\",'3.01.2'!C19)","v":""},{"$f":"IF('3.01.2'!D19=\"\",\"\",'3.01.2'!D19)","v":""},{"$f":"IF('3.01.2'!E19=\"\",\"\",'3.01.2'!E19)","v":""},{"$f":"IF('3.01.2'!F19=\"\",\"\",'3.01.2'!F19)","v":""},{"$f":"IF('3.01.2'!G19=\"\",\"\",'3.01.2'!G19)","v":""},{"$f":"IF('3.01.2'!H19=\"\",\"\",'3.01.2'!H19)","v":""},{"$f":"IF('3.01.2'!I19=\"\",\"\",'3.01.2'!I19)","v":""},{"$f":"IF('3.01.2'!J19=\"\",\"\",'3.01.2'!J19)","v":""}]
["3.01.2",0,"",2019,{"$f":"'3.01.2'!A20","v":"09"},{"$f":"IF('3.01.2'!B20=\"\",\"\",'3.01.2'!B20)","v":""},{"$f":"IF('3.01.2'!C20=\"\",\"\",'3.01.2'!C20)","v":""},{"$f":"IF('3.01.2'!D20=\"\",\"\",'3.01.2'!D20)","v":""},{"$f":"IF('3.01.2'!E20=\"\",\"\",'3.01.2'!E20)","v":""},{"$f":"IF('3.01.2'!F20=\"\",\"\",'3.01.2'!F20)","v":""},{"$f":"IF('3.01.2'!G20=\"\",\"\",'3.01.2'!G20)","v":""},{"$f":"IF('3.01.2'!H20=\"\",\"\",'3.01.2'!H20)","v":""},{"$f":"IF('3.01.2'!I20=\"\",\"\",'3.01.2'!I20)","v":""},{"$f":"IF('3.01.2'!J20=\"\",\"\",'3.01.2'!J20)","v":""}]
["3.01.2",0,"",2019,{"$f":"'3.01.2'!A21","v":"10"},{"$f":"IF('3.01.2'!B21=\"\",\"\",'3.01.2'!B21)","v":""},{"$f":"IF('3.01.2'!C21=\"\",\"\",'3.01.2'!C21)","v":""},{"$f":"IF('3.01.2'!D21=\"\",\"\",'3.01.2'!D21)","v":""},{"$f":"IF('3.01.2'!E21=\"\",\"\",'3.01.2'!E21)","v":""},{"$f":"IF('3.01.2'!F21=\"\",\"\",'3.01.2'!F21)","v":""},{"$f":"IF('3.01.2'!G21=\"\",\"\",'3.01.2'!G21)","v":""},{"$f":"IF('3.01.2'!H21=\"\",\"\",'3.01.2'!H21)","v":""},{"$f":"IF('3.01.2'!I21=\"\",\"\",'3.01.2'!I21)","v":""},{"$f":"IF('3.01.2'!J21=\"\",\"\",'3.01.2'!J21)","v":""}]
["3.01.2",0,"",2019,{"$f":"'3.01.2'!A22","v":"11"},{"$f":"IF('3.01.2'!B22=\"\",\"\",'3.01.2'!B22)","v":""},{"$f":"IF('3.01.2'!C22=\"\",\"\",'3.01.2'!C22)","v":""},{"$f":"IF('3.01.2'!D22=\"\",\"\",'3.01.2'!D22)","v":""},{"$f":"IF('3.01.2'!E22=\"\",\"\",'3.01.2'!E22)","v":""},{"$f":"IF('3.01.2'!F22=\"\",\"\",'3.01.2'!F22)","v":""},{"$f":"IF('3.01.2'!G22=\"\",\"\",'3.01.2'!G22)","v":""},{"$f":"IF('3.01.2'!H22=\"\",\"\",'3.01.2'!H22)","v":""},{"$f":"IF('3.01.2'!I22=\"\",\"\",'3.01.2'!I22)","v":""},{"$f":"IF('3.01.2'!J22=\"\",\"\",'3.01.2'!J22)","v":""}]
["3.01.2",0,"",2019,{"$f":"'3.01.2'!A23","v":"12"},{"$f":"IF('3.01.2'!B23=\"\",\"\",'3.01.2'!B23)","v":""},{"$f":"IF('3.01.2'!C23=\"\",\"\",'3.01.2'!C23)","v":""},{"$f":"IF('3.01.2'!D23=\"\",\"\",'3.01.2'!D23)","v":""},{"$f":"IF('3.01.2'!E23=\"\",\"\",'3.01.2'!E23)","v":""},{"$f":"IF('3.01.2'!F23=\"\",\"\",'3.01.2'!F23)","v":""},{"$f":"IF('3.01.2'!G23=\"\",\"\",'3.01.2'!G23)","v":""},{"$f":"IF('3.01.2'!H23=\"\",\"\",'3.01.2'!H23)","v":""},{"$f":"IF('3.01.2'!I23=\"\",\"\",'3.01.2'!I23)","v":""},{"$f":"IF('3.01.2'!J23=\"\",\"\",'3.01.2'!J23)","v":""}]
["3.01.2",0,"",2019,{"$f":"'3.01.2'!A24","v":"13"},{"$f":"IF('3.01.2'!B24=\"\",\"\",'3.01.2'!B24)","v":""},{"$f":"IF('3.01.2'!C24=\"\",\"\",'3.01.2'!C24)","v":""},{"$f":"IF('3.01.2'!D24=\"\",\"\",'3.01.2'!D24)","v":""},{"$f":"IF('3.01.2'!E24=\"\",\"\",'3.01.2'!E24)","v":""},{"$f":"IF('3.01.2'!F24=\"\",\"\",'3.01.2'!F24)","v":""},{"$f":"IF('3.01.2'!G24=\"\",\"\",'3.01.2'!G24)","v":""},{"$f":"IF('3.01.2'!H24=\"\",\"\",'3.01.2'!H24)","v":""},{"$f":"IF('3.01.2'!I24=\"\",\"\",'3.01.2'!I24)","v":""},{"$f":"IF('3.01.2'!J24=\"\",\"\",'3.01.2'!J24)","v":""}]
["3.01.2",0,"",2019,{"$f":"'3.01.2'!A25","v":"14"},{"$f":"IF('3.01.2'!B25=\"\",\"\",'3.01.2'!B25)","v":""},{"$f":"IF('3.01.2'!C25=\"\",\"\",'3.01.2'!C25)","v":""},{"$f":"IF('3.01.2'!D25=\"\",\"\",'3.01.2'!D25)","v":""},{"$f":"IF('3.01.2'!E25=\"\",\"\",'3.01.2'!E25)","v":""},{"$f":"IF('3.01.2'!F25=\"\",\"\",'3.01.2'!F25)","v":""},{"$f":"IF('3.01.2'!G25=\"\",\"\",'3.01.2'!G25)","v":""},{"$f":"IF('3.01.2'!H25=\"\",\"\",'3.01.2'!H25)","v":""},{"$f":"IF('3.01.2'!I25=\"\",\"\",'3.01.2'!I25)","v":""},{"$f":"IF('3.01.2'!J25=\"\",\"\",'3.01.2'!J25)","v":""}]
["3.01.2",0,"",2019,{"$f":"'3.01.2'!A26","v":"15"},{"$f":"IF('3.01.2'!B26=\"\",\"\",'3.01.2'!B26)","v":""},{"$f":"IF('3.01.2'!C26=\"\",\"\",'3.01.2'!C26)","v":""},{"$f":"IF('3.01.2'!D26=\"\",\"\",'3.01.2'!D26)","v":""},{"$f":"IF('3.01.2'!E26=\"\",\"\",'3.01.2'!E26)","v":""},{"$f":"IF('3.01.2'!F26=\"\",\"\",'3.01.2'!F26)","v":""},{"$f":"IF('3.01.2'!G26=\"\",\"\",'3.01.2'!G26)","v":""},{"$f":"IF('3.01.2'!H26=\"\",\"\",'3.01.2'!H26)","v":""},{"$f":"IF('3.01.2'!I26=\"\",\"\",'3.01.2'!I26)","v":""},{"$f":"IF('3.01.2'!J26=\"\",\"\",'3.01.2'!J26)","v":""}]
["3.01.2",0,"",2019,{"$f":"'3.01.2'!A27","v":"16"},{"$f":"IF('3.01.2'!B27=\"\",\"\",'3.01.2'!B27)","v":""},{"$f":"IF('3.01.2'!C27=\"\",\"\",'3.01.2'!C27)","v":""},{"$f":"IF('3.01.2'!D27=\"\",\"\",'3.01.2'!D27)","v":""},{"$f":"IF('3.01.2'!E27=\"\",\"\",'3.01.2'!E27)","v":""},{"$f":"IF('3.01.2'!F27=\"\",\"\",'3.01.2'!F27)","v":""},{"$f":"IF('3.01.2'!G27=\"\",\"\",'3.01.2'!G27)","v":""},{"$f":"IF('3.01.2'!H27=\"\",\"\",'3.01.2'!H27)","v":""},{"$f":"IF('3.01.2'!I27=\"\",\"\",'3.01.2'!I27)","v":""},{"$f":"IF('3.01.2'!J27=\"\",\"\",'3.01.2'!J27)","v":""}]
["3.01.2",0,"",2019,{"$f":"'3.01.2'!A28","v":"17"},{"$f":"IF('3.01.2'!B28=\"\",\"\",'3.01.2'!B28)","v":""},{"$f":"IF('3.01.2'!C28=\"\",\"\",'3.01.2'!C28)","v":""},{"$f":"IF('3.01.2'!D28=\"\",\"\",'3.01.2'!D28)","v":""},{"$f":"IF('3.01.2'!E28=\"\",\"\",'3.01.2'!E28)","v":""},{"$f":"IF('3.01.2'!F28=\"\",\"\",'3.01.2'!F28)","v":""},{"$f":"IF('3.01.2'!G28=\"\",\"\",'3.01.2'!G28)","v":""},{"$f":"IF('3.01.2'!H28=\"\",\"\",'3.01.2'!H28)","v":""},{"$f":"IF('3.01.2'!I28=\"\",\"\",'3.01.2'!I28)","v":""},{"$f":"IF('3.01.2'!J28=\"\",\"\",'3.01.2'!J28)","v":""}]
["3.01.2",0,"",2019,{"$f":"'3.01.2'!A29","v":"18"},{"$f":"IF('3.01.2'!B29=\"\",\"\",'3.01.2'!B29)","v":""},{"$f":"IF('3.01.2'!C29=\"\",\"\",'3.01.2'!C29)","v":""},{"$f":"IF('3.01.2'!D29=\"\",\"\",'3.01.2'!D29)","v":""},{"$f":"IF('3.01.2'!E29=\"\",\"\",'3.01.2'!E29)","v":""},{"$f":"IF('3.01.2'!F29=\"\",\"\",'3.01.2'!F29)","v":""},{"$f":"IF('3.01.2'!G29=\"\",\"\",'3.01.2'!G29)","v":""},{"$f":"IF('3.01.2'!H29=\"\",\"\",'3.01.2'!H29)","v":""},{"$f":"IF('3.01.2'!I29=\"\",\"\",'3.01.2'!I29)","v":""},{"$f":"IF('3.01.2'!J29=\"\",\"\",'3.01.2'!J29)","v":""}]
["3.01.2",0,"",2019,{"$f":"'3.01.2'!A30","v":"19"},{"$f":"IF('3.01.2'!B30=\"\",\"\",'3.01.2'!B30)","v":""},{"$f":"IF('3.01.2'!C30=\"\",\"\",'3.01.2'!C30)","v":""},{"$f":"IF('3.01.2'!D30=\"\",\"\",'3.01.2'!D30)","v":""},{"$f":"IF('3.01.2'!E30=\"\",\"\",'3.01.2'!E30)","v":""},{"$f":"IF('3.01.2'!F30=\"\",\"\",'3.01.2'!F30)","v":""},{"$f":"IF('3.01.2'!G30=\"\",\"\",'3.01.2'!G30)","v":""},{"$f":"IF('3.01.2'!H30=\"\",\"\",'3.01.2'!H30)","v":""},{"$f":"IF('3.01.2'!I30=\"\",\"\",'3.01.2'!I30)","v":""},{"$f":"IF('3.01.2'!J30=\"\",\"\",'3.01.2'!J30)","v":""}]
["3.01.2",0,"",2019,{"$f":"'3.01.2'!A31","v":"20"},{"$f":"IF('3.01.2'!B31=\"\",\"\",'3.01.2'!B31)","v":""},{"$f":"IF('3.01.2'!C31=\"\",\"\",'3.01.2'!C31)","v":""},{"$f":"IF('3.01.2'!D31=\"\",\"\",'3.01.2'!D31)","v":""},{"$f":"IF('3.01.2'!E31=\"\",\"\",'3.01.2'!E31)","v":""},{"$f":"IF('3.01.2'!F31=\"\",\"\",'3.01.2'!F31)","v":""},{"$f":"IF('3.01.2'!G31=\"\",\"\",'3.01.2'!G31)","v":""},{"$f":"IF('3.01.2'!H31=\"\",\"\",'3.01.2'!H31)","v":""},{"$f":"IF('3.01.2'!I31=\"\",\"\",'3.01.2'!I31)","v":""},{"$f":"IF('3.01.2'!J31=\"\",\"\",'3.01.2'!J31)","v":""}]
["3.01.2",0,"",2019,{"$f":"'3.01.2'!A32","v":"21"},{"$f":"IF('3.01.2'!B32=\"\",\"\",'3.01.2'!B32)","v":""},{"$f":"IF('3.01.2'!C32=\"\",\"\",'3.01.2'!C32)","v":""},{"$f":"IF('3.01.2'!D32=\"\",\"\",'3.01.2'!D32)","v":""},{"$f":"IF('3.01.2'!E32=\"\",\"\",'3.01.2'!E32)","v":""},{"$f":"IF('3.01.2'!F32=\"\",\"\",'3.01.2'!F32)","v":""},{"$f":"IF('3.01.2'!G32=\"\",\"\",'3.01.2'!G32)","v":""},{"$f":"IF('3.01.2'!H32=\"\",\"\",'3.01.2'!H32)","v":""},{"$f":"IF('3.01.2'!I32=\"\",\"\",'3.01.2'!I32)","v":""},{"$f":"IF('3.01.2'!J32=\"\",\"\",'3.01.2'!J32)","v":""}]
["3.01.2",0,"",2019,{"$f":"'3.01.2'!A33","v":"22"},{"$f":"IF('3.01.2'!B33=\"\",\"\",'3.01.2'!B33)","v":""},{"$f":"IF('3.01.2'!C33=\"\",\"\",'3.01.2'!C33)","v":""},{"$f":"IF('3.01.2'!D33=\"\",\"\",'3.01.2'!D33)","v":""},{"$f":"IF('3.01.2'!E33=\"\",\"\",'3.01.2'!E33)","v":""},{"$f":"IF('3.01.2'!F33=\"\",\"\",'3.01.2'!F33)","v":""},{"$f":"IF('3.01.2'!G33=\"\",\"\",'3.01.2'!G33)","v":""},{"$f":"IF('3.01.2'!H33=\"\",\"\",'3.01.2'!H33)","v":""},{"$f":"IF('3.01.2'!I33=\"\",\"\",'3.01.2'!I33)","v":""},{"$f":"IF('3.01.2'!J33=\"\",\"\",'3.01.2'!J33)","v":""}]
["3.01.2",0,"",2019,{"$f":"'3.01.2'!A34","v":"23"},{"$f":"IF('3.01.2'!B34=\"\",\"\",'3.01.2'!B34)","v":""},{"$f":"IF('3.01.2'!C34=\"\",\"\",'3.01.2'!C34)","v":""},{"$f":"IF('3.01.2'!D34=\"\",\"\",'3.01.2'!D34)","v":""},{"$f":"IF('3.01.2'!E34=\"\",\"\",'3.01.2'!E34)","v":""},{"$f":"IF('3.01.2'!F34=\"\",\"\",'3.01.2'!F34)","v":""},{"$f":"IF('3.01.2'!G34=\"\",\"\",'3.01.2'!G34)","v":""},{"$f":"IF('3.01.2'!H34=\"\",\"\",'3.01.2'!H34)","v":""},{"$f":"IF('3.01.2'!I34=\"\",\"\",'3.01.2'!I34)","v":""},{"$f":"IF('3.01.2'!J34=\"\",\"\",'3.01.2'!J34)","v":""}]
["3.01.2",0,"",2019,{"$f":"'3.01.2'!A35","v":"24"},{"$f":"IF('3.01.2'!B35=\"\",\"\",'3.01.2'!B35)","v":""},{"$f":"IF('3.01.2'!C35=\"\",\"\",'3.01.2'!C35)","v":""},{"$f":"IF('3.01.2'!D35=\"\",\"\",'3.01.2'!D35)","v":""},{"$f":"IF('3.01.2'!E35=\"\",\"\",'3.01.2'!E35)","v":""},{"$f":"IF('3.01.2'!F35=\"\",\"\",'3.01.2'!F35)","v":""},{"$f":"IF('3.01.2'!G35=\"\",\"\",'3.01.2'!G35)","v":""},{"$f":"IF('3.01.2'!H35=\"\",\"\",'3.01.2'!H35)","v":""},{"$f":"IF('3.01.2'!I35=\"\",\"\",'3.01.2'!I35)","v":""},{"$f":"IF('3.01.2'!J35=\"\",\"\",'3.01.2'!J35)","v":""}]
["3.01.2",0,"",2019,{"$f":"'3.01.2'!A36","v":"25"},{"$f":"IF('3.01.2'!B36=\"\",\"\",'3.01.2'!B36)","v":""},{"$f":"IF('3.01.2'!C36=\"\",\"\",'3.01.2'!C36)","v":""},{"$f":"IF('3.01.2'!D36=\"\",\"\",'3.01.2'!D36)","v":""},{"$f":"IF('3.01.2'!E36=\"\",\"\",'3.01.2'!E36)","v":""},{"$f":"IF('3.01.2'!F36=\"\",\"\",'3.01.2'!F36)","v":""},{"$f":"IF('3.01.2'!G36=\"\",\"\",'3.01.2'!G36)","v":""},{"$f":"IF('3.01.2'!H36=\"\",\"\",'3.01.2'!H36)","v":""},{"$f":"IF('3.01.2'!I36=\"\",\"\",'3.01.2'!I36)","v":""},{"$f":"IF('3.01.2'!J36=\"\",\"\",'3.01.2'!J36)","v":""}]
["3.01.2",0,"",2019,{"$f":"'3.01.2'!A37","v":"26"},{"$f":"IF('3.01.2'!B37=\"\",\"\",'3.01.2'!B37)","v":""},{"$f":"IF('3.01.2'!C37=\"\",\"\",'3.01.2'!C37)","v":""},{"$f":"IF('3.01.2'!D37=\"\",\"\",'3.01.2'!D37)","v":""},{"$f":"IF('3.01.2'!E37=\"\",\"\",'3.01.2'!E37)","v":""},{"$f":"IF('3.01.2'!F37=\"\",\"\",'3.01.2'!F37)","v":""},{"$f":"IF('3.01.2'!G37=\"\",\"\",'3.01.2'!G37)","v":""},{"$f":"IF('3.01.2'!H37=\"\",\"\",'3.01.2'!H37)","v":""},{"$f":"IF('3.01.2'!I37=\"\",\"\",'3.01.2'!I37)","v":""},{"$f":"IF('3.01.2'!J37=\"\",\"\",'3.01.2'!J37)","v":""}]
["3.01.2",0,"",2019,{"$f":"'3.01.2'!A38","v":"27"},{"$f":"IF('3.01.2'!B38=\"\",\"\",'3.01.2'!B38)","v":""},{"$f":"IF('3.01.2'!C38=\"\",\"\",'3.01.2'!C38)","v":""},{"$f":"IF('3.01.2'!D38=\"\",\"\",'3.01.2'!D38)","v":""},{"$f":"IF('3.01.2'!E38=\"\",\"\",'3.01.2'!E38)","v":""},{"$f":"IF('3.01.2'!F38=\"\",\"\",'3.01.2'!F38)","v":""},{"$f":"IF('3.01.2'!G38=\"\",\"\",'3.01.2'!G38)","v":""},{"$f":"IF('3.01.2'!H38=\"\",\"\",'3.01.2'!H38)","v":""},{"$f":"IF('3.01.2'!I38=\"\",\"\",'3.01.2'!I38)","v":""},{"$f":"IF('3.01.2'!J38=\"\",\"\",'3.01.2'!J38)","v":""}]
["3.01.2",0,"",{"$f":"Year","v":2019},{"$f":"'3.01.2'!A39","v":"28"},{"$f":"IF('3.01.2'!B39=\"\",\"\",'3.01.2'!B39)","v":""},{"$f":"IF('3.01.2'!C39=\"\",\"\",'3.01.2'!C39)","v":""},{"$f":"IF('3.01.2'!D39=\"\",\"\",'3.01.2'!D39)","v":""},{"$f":"IF('3.01.2'!E39=\"\",\"\",'3.01.2'!E39)","v":""},{"$f":"IF('3.01.2'!F39=\"\",\"\",'3.01.2'!F39)","v":""},{"$f":"IF('3.01.2'!G39=\"\",\"\",'3.01.2'!G39)","v":""},{"$f":"IF('3.01.2'!H39=\"\",\"\",'3.01.2'!H39)","v":""},{"$f":"IF('3.01.2'!I39=\"\",\"\",'3.01.2'!I39)","v":""},{"$f":"IF('3.01.2'!J39=\"\",\"\",'3.01.2'!J39)","v":""}]
["3.01.2",0,"",2019,{"$f":"'3.01.2'!A40","v":"29"},{"$f":"IF('3.01.2'!B40=\"\",\"\",'3.01.2'!B40)","v":""},{"$f":"IF('3.01.2'!C40=\"\",\"\",'3.01.2'!C40)","v":""},{"$f":"IF('3.01.2'!D40=\"\",\"\",'3.01.2'!D40)","v":""},{"$f":"IF('3.01.2'!E40=\"\",\"\",'3.01.2'!E40)","v":""},{"$f":"IF('3.01.2'!F40=\"\",\"\",'3.01.2'!F40)","v":""},{"$f":"IF('3.01.2'!G40=\"\",\"\",'3.01.2'!G40)","v":""},{"$f":"IF('3.01.2'!H40=\"\",\"\",'3.01.2'!H40)","v":""},{"$f":"IF('3.01.2'!I40=\"\",\"\",'3.01.2'!I40)","v":""},{"$f":"IF('3.01.2'!J40=\"\",\"\",'3.01.2'!J40)","v":""}]
["3.01.2",0,"",2019,{"$f":"'3.01.2'!A41","v":"30"},{"$f":"IF('3.01.2'!B41=\"\",\"\",'3.01.2'!B41)","v":""},{"$f":"IF('3.01.2'!C41=\"\",\"\",'3.01.2'!C41)","v":""},{"$f":"IF('3.01.2'!D41=\"\",\"\",'3.01.2'!D41)","v":""},{"$f":"IF('3.01.2'!E41=\"\",\"\",'3.01.2'!E41)","v":""},{"$f":"IF('3.01.2'!F41=\"\",\"\",'3.01.2'!F41)","v":""},{"$f":"IF('3.01.2'!G41=\"\",\"\",'3.01.2'!G41)","v":""},{"$f":"IF('3.01.2'!H41=\"\",\"\",'3.01.2'!H41)","v":""},{"$f":"IF('3.01.2'!I41=\"\",\"\",'3.01.2'!I41)","v":""},{"$f":"IF('3.01.2'!J41=\"\",\"\",'3.01.2'!J41)","v":""}]
["3.01.2",0,"",2019,{"$f":"'3.01.2'!A42","v":"31"},{"$f":"IF('3.01.2'!B42=\"\",\"\",'3.01.2'!B42)","v":""},{"$f":"IF('3.01.2'!C42=\"\",\"\",'3.01.2'!C42)","v":""},{"$f":"IF('3.01.2'!D42=\"\",\"\",'3.01.2'!D42)","v":""},{"$f":"IF('3.01.2'!E42=\"\",\"\",'3.01.2'!E42)","v":""},{"$f":"IF('3.01.2'!F42=\"\",\"\",'3.01.2'!F42)","v":""},{"$f":"IF('3.01.2'!G42=\"\",\"\",'3.01.2'!G42)","v":""},{"$f":"IF('3.01.2'!H42=\"\",\"\",'3.01.2'!H42)","v":""},{"$f":"IF('3.01.2'!I42=\"\",\"\",'3.01.2'!I42)","v":""},{"$f":"IF('3.01.2'!J42=\"\",\"\",'3.01.2'!J42)","v":""}]
["3.01.2",0,"",2019,{"$f":"'3.01.2'!A43","v":"32"},{"$f":"IF('3.01.2'!B43=\"\",\"\",'3.01.2'!B43)","v":""},{"$f":"IF('3.01.2'!C43=\"\",\"\",'3.01.2'!C43)","v":""},{"$f":"IF('3.01.2'!D43=\"\",\"\",'3.01.2'!D43)","v":""},{"$f":"IF('3.01.2'!E43=\"\",\"\",'3.01.2'!E43)","v":""},{"$f":"IF('3.01.2'!F43=\"\",\"\",'3.01.2'!F43)","v":""},{"$f":"IF('3.01.2'!G43=\"\",\"\",'3.01.2'!G43)","v":""},{"$f":"IF('3.01.2'!H43=\"\",\"\",'3.01.2'!H43)","v":""},{"$f":"IF('3.01.2'!I43=\"\",\"\",'3.01.2'!I43)","v":""},{"$f":"IF('3.01.2'!J43=\"\",\"\",'3.01.2'!J43)","v":""}]
["3.01.2",0,"",2019,{"$f":"'3.01.2'!A44","v":"33"},{"$f":"IF('3.01.2'!B44=\"\",\"\",'3.01.2'!B44)","v":""},{"$f":"IF('3.01.2'!C44=\"\",\"\",'3.01.2'!C44)","v":""},{"$f":"IF('3.01.2'!D44=\"\",\"\",'3.01.2'!D44)","v":""},{"$f":"IF('3.01.2'!E44=\"\",\"\",'3.01.2'!E44)","v":""},{"$f":"IF('3.01.2'!F44=\"\",\"\",'3.01.2'!F44)","v":""},{"$f":"IF('3.01.2'!G44=\"\",\"\",'3.01.2'!G44)","v":""},{"$f":"IF('3.01.2'!H44=\"\",\"\",'3.01.2'!H44)","v":""},{"$f":"IF('3.01.2'!I44=\"\",\"\",'3.01.2'!I44)","v":""},{"$f":"IF('3.01.2'!J44=\"\",\"\",'3.01.2'!J44)","v":""}]
["3.01.2",0,"",2019,{"$f":"'3.01.2'!A45","v":"34"},{"$f":"IF('3.01.2'!B45=\"\",\"\",'3.01.2'!B45)","v":""},{"$f":"IF('3.01.2'!C45=\"\",\"\",'3.01.2'!C45)","v":""},{"$f":"IF('3.01.2'!D45=\"\",\"\",'3.01.2'!D45)","v":""},{"$f":"IF('3.01.2'!E45=\"\",\"\",'3.01.2'!E45)","v":""},{"$f":"IF('3.01.2'!F45=\"\",\"\",'3.01.2'!F45)","v":""},{"$f":"IF('3.01.2'!G45=\"\",\"\",'3.01.2'!G45)","v":""},{"$f":"IF('3.01.2'!H45=\"\",\"\",'3.01.2'!H45)","v":""},{"$f":"IF('3.01.2'!I45=\"\",\"\",'3.01.2'!I45)","v":""},{"$f":"IF('3.01.2'!J45=\"\",\"\",'3.01.2'!J45)","v":""}]
["3.01.2",0,"",2019,{"$f":"'3.01.2'!A46","v":"35"},{"$f":"IF('3.01.2'!B46=\"\",\"\",'3.01.2'!B46)","v":""},{"$f":"IF('3.01.2'!C46=\"\",\"\",'3.01.2'!C46)","v":""},{"$f":"IF('3.01.2'!D46=\"\",\"\",'3.01.2'!D46)","v":""},{"$f":"IF('3.01.2'!E46=\"\",\"\",'3.01.2'!E46)","v":""},{"$f":"IF('3.01.2'!F46=\"\",\"\",'3.01.2'!F46)","v":""},{"$f":"IF('3.01.2'!G46=\"\",\"\",'3.01.2'!G46)","v":""},{"$f":"IF('3.01.2'!H46=\"\",\"\",'3.01.2'!H46)","v":""},{"$f":"IF('3.01.2'!I46=\"\",\"\",'3.01.2'!I46)","v":""},{"$f":"IF('3.01.2'!J46=\"\",\"\",'3.01.2'!J46)","v":""}]
["3.01.2",0,"",2019,{"$f":"'3.01.2'!A47","v":"36"},{"$f":"IF('3.01.2'!B47=\"\",\"\",'3.01.2'!B47)","v":""},{"$f":"IF('3.01.2'!C47=\"\",\"\",'3.01.2'!C47)","v":""},{"$f":"IF('3.01.2'!D47=\"\",\"\",'3.01.2'!D47)","v":""},{"$f":"IF('3.01.2'!E47=\"\",\"\",'3.01.2'!E47)","v":""},{"$f":"IF('3.01.2'!F47=\"\",\"\",'3.01.2'!F47)","v":""},{"$f":"IF('3.01.2'!G47=\"\",\"\",'3.01.2'!G47)","v":""},{"$f":"IF('3.01.2'!H47=\"\",\"\",'3.01.2'!H47)","v":""},{"$f":"IF('3.01.2'!I47=\"\",\"\",'3.01.2'!I47)","v":""},{"$f":"IF('3.01.2'!J47=\"\",\"\",'3.01.2'!J47)","v":""}]
["3.01.2",0,"",2019,{"$f":"'3.01.2'!A48","v":"37"},{"$f":"IF('3.01.2'!B48=\"\",\"\",'3.01.2'!B48)","v":""},{"$f":"IF('3.01.2'!C48=\"\",\"\",'3.01.2'!C48)","v":""},{"$f":"IF('3.01.2'!D48=\"\",\"\",'3.01.2'!D48)","v":""},{"$f":"IF('3.01.2'!E48=\"\",\"\",'3.01.2'!E48)","v":""},{"$f":"IF('3.01.2'!F48=\"\",\"\",'3.01.2'!F48)","v":""},{"$f":"IF('3.01.2'!G48=\"\",\"\",'3.01.2'!G48)","v":""},{"$f":"IF('3.01.2'!H48=\"\",\"\",'3.01.2'!H48)","v":""},{"$f":"IF('3.01.2'!I48=\"\",\"\",'3.01.2'!I48)","v":""},{"$f":"IF('3.01.2'!J48=\"\",\"\",'3.01.2'!J48)","v":""}]
["3.01.2",0,"",2019,{"$f":"'3.01.2'!A49","v":"38"},{"$f":"IF('3.01.2'!B49=\"\",\"\",'3.01.2'!B49)","v":""},{"$f":"IF('3.01.2'!C49=\"\",\"\",'3.01.2'!C49)","v":""},{"$f":"IF('3.01.2'!D49=\"\",\"\",'3.01.2'!D49)","v":""},{"$f":"IF('3.01.2'!E49=\"\",\"\",'3.01.2'!E49)","v":""},{"$f":"IF('3.01.2'!F49=\"\",\"\",'3.01.2'!F49)","v":""},{"$f":"IF('3.01.2'!G49=\"\",\"\",'3.01.2'!G49)","v":""},{"$f":"IF('3.01.2'!H49=\"\",\"\",'3.01.2'!H49)","v":""},{"$f":"IF('3.01.2'!I49=\"\",\"\",'3.01.2'!I49)","v":""},{"$f":"IF('3.01.2'!J49=\"\",\"\",'3.01.2'!J49)","v":""}]
["3.01.2",0,"",2019,{"$f":"'3.01.2'!A50","v":"39"},{"$f":"IF('3.01.2'!B50=\"\",\"\",'3.01.2'!B50)","v":""},{"$f":"IF('3.01.2'!C50=\"\",\"\",'3.01.2'!C50)","v":""},{"$f":"IF('3.01.2'!D50=\"\",\"\",'3.01.2'!D50)","v":""},{"$f":"IF('3.01.2'!E50=\"\",\"\",'3.01.2'!E50)","v":""},{"$f":"IF('3.01.2'!F50=\"\",\"\",'3.01.2'!F50)","v":""},{"$f":"IF('3.01.2'!G50=\"\",\"\",'3.01.2'!G50)","v":""},{"$f":"IF('3.01.2'!H50=\"\",\"\",'3.01.2'!H50)","v":""},{"$f":"IF('3.01.2'!I50=\"\",\"\",'3.01.2'!I50)","v":""},{"$f":"IF('3.01.2'!J50=\"\",\"\",'3.01.2'!J50)","v":""}]
["3.01.2",0,"",2019,{"$f":"'3.01.2'!A51","v":"40"},{"$f":"IF('3.01.2'!B51=\"\",\"\",'3.01.2'!B51)","v":""},{"$f":"IF('3.01.2'!C51=\"\",\"\",'3.01.2'!C51)","v":""},{"$f":"IF('3.01.2'!D51=\"\",\"\",'3.01.2'!D51)","v":""},{"$f":"IF('3.01.2'!E51=\"\",\"\",'3.01.2'!E51)","v":""},{"$f":"IF('3.01.2'!F51=\"\",\"\",'3.01.2'!F51)","v":""},{"$f":"IF('3.01.2'!G51=\"\",\"\",'3.01.2'!G51)","v":""},{"$f":"IF('3.01.2'!H51=\"\",\"\",'3.01.2'!H51)","v":""},{"$f":"IF('3.01.2'!I51=\"\",\"\",'3.01.2'!I51)","v":""},{"$f":"IF('3.01.2'!J51=\"\",\"\",'3.01.2'!J51)","v":""}]
["3.01.2",0,"",2019,{"$f":"'3.01.2'!A52","v":"41"},{"$f":"IF('3.01.2'!B52=\"\",\"\",'3.01.2'!B52)","v":""},{"$f":"IF('3.01.2'!C52=\"\",\"\",'3.01.2'!C52)","v":""},{"$f":"IF('3.01.2'!D52=\"\",\"\",'3.01.2'!D52)","v":""},{"$f":"IF('3.01.2'!E52=\"\",\"\",'3.01.2'!E52)","v":""},{"$f":"IF('3.01.2'!F52=\"\",\"\",'3.01.2'!F52)","v":""},{"$f":"IF('3.01.2'!G52=\"\",\"\",'3.01.2'!G52)","v":""},{"$f":"IF('3.01.2'!H52=\"\",\"\",'3.01.2'!H52)","v":""},{"$f":"IF('3.01.2'!I52=\"\",\"\",'3.01.2'!I52)","v":""},{"$f":"IF('3.01.2'!J52=\"\",\"\",'3.01.2'!J52)","v":""}]
["3.01.2",0,"",2019,{"$f":"'3.01.2'!A53","v":"42"},{"$f":"IF('3.01.2'!B53=\"\",\"\",'3.01.2'!B53)","v":""},{"$f":"IF('3.01.2'!C53=\"\",\"\",'3.01.2'!C53)","v":""},{"$f":"IF('3.01.2'!D53=\"\",\"\",'3.01.2'!D53)","v":""},{"$f":"IF('3.01.2'!E53=\"\",\"\",'3.01.2'!E53)","v":""},{"$f":"IF('3.01.2'!F53=\"\",\"\",'3.01.2'!F53)","v":""},{"$f":"IF('3.01.2'!G53=\"\",\"\",'3.01.2'!G53)","v":""},{"$f":"IF('3.01.2'!H53=\"\",\"\",'3.01.2'!H53)","v":""},{"$f":"IF('3.01.2'!I53=\"\",\"\",'3.01.2'!I53)","v":""},{"$f":"IF('3.01.2'!J53=\"\",\"\",'3.01.2'!J53)","v":""}]
["3.01.2",0,"",2019,{"$f":"'3.01.2'!A54","v":"43"},{"$f":"IF('3.01.2'!B54=\"\",\"\",'3.01.2'!B54)","v":""},{"$f":"IF('3.01.2'!C54=\"\",\"\",'3.01.2'!C54)","v":""},{"$f":"IF('3.01.2'!D54=\"\",\"\",'3.01.2'!D54)","v":""},{"$f":"IF('3.01.2'!E54=\"\",\"\",'3.01.2'!E54)","v":""},{"$f":"IF('3.01.2'!F54=\"\",\"\",'3.01.2'!F54)","v":""},{"$f":"IF('3.01.2'!G54=\"\",\"\",'3.01.2'!G54)","v":""},{"$f":"IF('3.01.2'!H54=\"\",\"\",'3.01.2'!H54)","v":""},{"$f":"IF('3.01.2'!I54=\"\",\"\",'3.01.2'!I54)","v":""},{"$f":"IF('3.01.2'!J54=\"\",\"\",'3.01.2'!J54)","v":""}]
["3.01.2",0,"",2019,{"$f":"'3.01.2'!A55","v":"44"},{"$f":"IF('3.01.2'!B55=\"\",\"\",'3.01.2'!B55)","v":""},{"$f":"IF('3.01.2'!C55=\"\",\"\",'3.01.2'!C55)","v":""},{"$f":"IF('3.01.2'!D55=\"\",\"\",'3.01.2'!D55)","v":""},{"$f":"IF('3.01.2'!E55=\"\",\"\",'3.01.2'!E55)","v":""},{"$f":"IF('3.01.2'!F55=\"\",\"\",'3.01.2'!F55)","v":""},{"$f":"IF('3.01.2'!G55=\"\",\"\",'3.01.2'!G55)","v":""},{"$f":"IF('3.01.2'!H55=\"\",\"\",'3.01.2'!H55)","v":""},{"$f":"IF('3.01.2'!I55=\"\",\"\",'3.01.2'!I55)","v":""},{"$f":"IF('3.01.2'!J55=\"\",\"\",'3.01.2'!J55)","v":""}]
["3.01.2",0,"",2019,{"$f":"'3.01.2'!A56","v":"45"},{"$f":"IF('3.01.2'!B56=\"\",\"\",'3.01.2'!B56)","v":""},{"$f":"IF('3.01.2'!C56=\"\",\"\",'3.01.2'!C56)","v":""},{"$f":"IF('3.01.2'!D56=\"\",\"\",'3.01.2'!D56)","v":""},{"$f":"IF('3.01.2'!E56=\"\",\"\",'3.01.2'!E56)","v":""},{"$f":"IF('3.01.2'!F56=\"\",\"\",'3.01.2'!F56)","v":""},{"$f":"IF('3.01.2'!G56=\"\",\"\",'3.01.2'!G56)","v":""},{"$f":"IF('3.01.2'!H56=\"\",\"\",'3.01.2'!H56)","v":""},{"$f":"IF('3.01.2'!I56=\"\",\"\",'3.01.2'!I56)","v":""},{"$f":"IF('3.01.2'!J56=\"\",\"\",'3.01.2'!J56)","v":""}]
["3.01.2",0,"",2019,{"$f":"'3.01.2'!A57","v":"46"},{"$f":"IF('3.01.2'!B57=\"\",\"\",'3.01.2'!B57)","v":""},{"$f":"IF('3.01.2'!C57=\"\",\"\",'3.01.2'!C57)","v":""},{"$f":"IF('3.01.2'!D57=\"\",\"\",'3.01.2'!D57)","v":""},{"$f":"IF('3.01.2'!E57=\"\",\"\",'3.01.2'!E57)","v":""},{"$f":"IF('3.01.2'!F57=\"\",\"\",'3.01.2'!F57)","v":""},{"$f":"IF('3.01.2'!G57=\"\",\"\",'3.01.2'!G57)","v":""},{"$f":"IF('3.01.2'!H57=\"\",\"\",'3.01.2'!H57)","v":""},{"$f":"IF('3.01.2'!I57=\"\",\"\",'3.01.2'!I57)","v":""},{"$f":"IF('3.01.2'!J57=\"\",\"\",'3.01.2'!J57)","v":""}]
["3.01.2",0,"",2019,{"$f":"'3.01.2'!A58","v":"47"},{"$f":"IF('3.01.2'!B58=\"\",\"\",'3.01.2'!B58)","v":""},{"$f":"IF('3.01.2'!C58=\"\",\"\",'3.01.2'!C58)","v":""},{"$f":"IF('3.01.2'!D58=\"\",\"\",'3.01.2'!D58)","v":""},{"$f":"IF('3.01.2'!E58=\"\",\"\",'3.01.2'!E58)","v":""},{"$f":"IF('3.01.2'!F58=\"\",\"\",'3.01.2'!F58)","v":""},{"$f":"IF('3.01.2'!G58=\"\",\"\",'3.01.2'!G58)","v":""},{"$f":"IF('3.01.2'!H58=\"\",\"\",'3.01.2'!H58)","v":""},{"$f":"IF('3.01.2'!I58=\"\",\"\",'3.01.2'!I58)","v":""},{"$f":"IF('3.01.2'!J58=\"\",\"\",'3.01.2'!J58)","v":""}]
["3.01.2",0,"",2019,{"$f":"'3.01.2'!A59","v":"48"},{"$f":"IF('3.01.2'!B59=\"\",\"\",'3.01.2'!B59)","v":""},{"$f":"IF('3.01.2'!C59=\"\",\"\",'3.01.2'!C59)","v":""},{"$f":"IF('3.01.2'!D59=\"\",\"\",'3.01.2'!D59)","v":""},{"$f":"IF('3.01.2'!E59=\"\",\"\",'3.01.2'!E59)","v":""},{"$f":"IF('3.01.2'!F59=\"\",\"\",'3.01.2'!F59)","v":""},{"$f":"IF('3.01.2'!G59=\"\",\"\",'3.01.2'!G59)","v":""},{"$f":"IF('3.01.2'!H59=\"\",\"\",'3.01.2'!H59)","v":""},{"$f":"IF('3.01.2'!I59=\"\",\"\",'3.01.2'!I59)","v":""},{"$f":"IF('3.01.2'!J59=\"\",\"\",'3.01.2'!J59)","v":""}]
["3.01.2",0,"",2019,{"$f":"'3.01.2'!A60","v":"49"},{"$f":"IF('3.01.2'!B60=\"\",\"\",'3.01.2'!B60)","v":""},{"$f":"IF('3.01.2'!C60=\"\",\"\",'3.01.2'!C60)","v":""},{"$f":"IF('3.01.2'!D60=\"\",\"\",'3.01.2'!D60)","v":""},{"$f":"IF('3.01.2'!E60=\"\",\"\",'3.01.2'!E60)","v":""},{"$f":"IF('3.01.2'!F60=\"\",\"\",'3.01.2'!F60)","v":""},{"$f":"IF('3.01.2'!G60=\"\",\"\",'3.01.2'!G60)","v":""},{"$f":"IF('3.01.2'!H60=\"\",\"\",'3.01.2'!H60)","v":""},{"$f":"IF('3.01.2'!I60=\"\",\"\",'3.01.2'!I60)","v":""},{"$f":"IF('3.01.2'!J60=\"\",\"\",'3.01.2'!J60)","v":""}]
["3.01.2",0,"",2019,{"$f":"'3.01.2'!A61","v":"50"},{"$f":"IF('3.01.2'!B61=\"\",\"\",'3.01.2'!B61)","v":""},{"$f":"IF('3.01.2'!C61=\"\",\"\",'3.01.2'!C61)","v":""},{"$f":"IF('3.01.2'!D61=\"\",\"\",'3.01.2'!D61)","v":""},{"$f":"IF('3.01.2'!E61=\"\",\"\",'3.01.2'!E61)","v":""},{"$f":"IF('3.01.2'!F61=\"\",\"\",'3.01.2'!F61)","v":""},{"$f":"IF('3.01.2'!G61=\"\",\"\",'3.01.2'!G61)","v":""},{"$f":"IF('3.01.2'!H61=\"\",\"\",'3.01.2'!H61)","v":""},{"$f":"IF('3.01.2'!I61=\"\",\"\",'3.01.2'!I61)","v":""},{"$f":"IF('3.01.2'!J61=\"\",\"\",'3.01.2'!J61)","v":""}]
["3.01.2",0,"",2019,{"$f":"'3.01.2'!A62","v":"51"},{"$f":"IF('3.01.2'!B62=\"\",\"\",'3.01.2'!B62)","v":""},{"$f":"IF('3.01.2'!C62=\"\",\"\",'3.01.2'!C62)","v":""},{"$f":"IF('3.01.2'!D62=\"\",\"\",'3.01.2'!D62)","v":""},{"$f":"IF('3.01.2'!E62=\"\",\"\",'3.01.2'!E62)","v":""},{"$f":"IF('3.01.2'!F62=\"\",\"\",'3.01.2'!F62)","v":""},{"$f":"IF('3.01.2'!G62=\"\",\"\",'3.01.2'!G62)","v":""},{"$f":"IF('3.01.2'!H62=\"\",\"\",'3.01.2'!H62)","v":""},{"$f":"IF('3.01.2'!I62=\"\",\"\",'3.01.2'!I62)","v":""},{"$f":"IF('3.01.2'!J62=\"\",\"\",'3.01.2'!J62)","v":""}]
["3.01.2",0,"",2019,{"$f":"'3.01.2'!A63","v":"52"},{"$f":"IF('3.01.2'!B63=\"\",\"\",'3.01.2'!B63)","v":""},{"$f":"IF('3.01.2'!C63=\"\",\"\",'3.01.2'!C63)","v":""},{"$f":"IF('3.01.2'!D63=\"\",\"\",'3.01.2'!D63)","v":""},{"$f":"IF('3.01.2'!E63=\"\",\"\",'3.01.2'!E63)","v":""},{"$f":"IF('3.01.2'!F63=\"\",\"\",'3.01.2'!F63)","v":""},{"$f":"IF('3.01.2'!G63=\"\",\"\",'3.01.2'!G63)","v":""},{"$f":"IF('3.01.2'!H63=\"\",\"\",'3.01.2'!H63)","v":""},{"$f":"IF('3.01.2'!I63=\"\",\"\",'3.01.2'!I63)","v":""},{"$f":"IF('3.01.2'!J63=\"\",\"\",'3.01.2'!J63)","v":""}]
["3.01.2",0,"",2019,{"$f":"'3.01.2'!A64","v":"53"},{"$f":"IF('3.01.2'!B64=\"\",\"\",'3.01.2'!B64)","v":""},{"$f":"IF('3.01.2'!C64=\"\",\"\",'3.01.2'!C64)","v":""},{"$f":"IF('3.01.2'!D64=\"\",\"\",'3.01.2'!D64)","v":""},{"$f":"IF('3.01.2'!E64=\"\",\"\",'3.01.2'!E64)","v":""},{"$f":"IF('3.01.2'!F64=\"\",\"\",'3.01.2'!F64)","v":""},{"$f":"IF('3.01.2'!G64=\"\",\"\",'3.01.2'!G64)","v":""},{"$f":"IF('3.01.2'!H64=\"\",\"\",'3.01.2'!H64)","v":""},{"$f":"IF('3.01.2'!I64=\"\",\"\",'3.01.2'!I64)","v":""},{"$f":"IF('3.01.2'!J64=\"\",\"\",'3.01.2'!J64)","v":""}]
["3.01.2",0,"",2019,{"$f":"'3.01.2'!A65","v":"54"},{"$f":"IF('3.01.2'!B65=\"\",\"\",'3.01.2'!B65)","v":""},{"$f":"IF('3.01.2'!C65=\"\",\"\",'3.01.2'!C65)","v":""},{"$f":"IF('3.01.2'!D65=\"\",\"\",'3.01.2'!D65)","v":""},{"$f":"IF('3.01.2'!E65=\"\",\"\",'3.01.2'!E65)","v":""},{"$f":"IF('3.01.2'!F65=\"\",\"\",'3.01.2'!F65)","v":""},{"$f":"IF('3.01.2'!G65=\"\",\"\",'3.01.2'!G65)","v":""},{"$f":"IF('3.01.2'!H65=\"\",\"\",'3.01.2'!H65)","v":""},{"$f":"IF('3.01.2'!I65=\"\",\"\",'3.01.2'!I65)","v":""},{"$f":"IF('3.01.2'!J65=\"\",\"\",'3.01.2'!J65)","v":""}]
["3.01.2",0,"",2019,{"$f":"'3.01.2'!A66","v":"55"},{"$f":"IF('3.01.2'!B66=\"\",\"\",'3.01.2'!B66)","v":""},{"$f":"IF('3.01.2'!C66=\"\",\"\",'3.01.2'!C66)","v":""},{"$f":"IF('3.01.2'!D66=\"\",\"\",'3.01.2'!D66)","v":""},{"$f":"IF('3.01.2'!E66=\"\",\"\",'3.01.2'!E66)","v":""},{"$f":"IF('3.01.2'!F66=\"\",\"\",'3.01.2'!F66)","v":""},{"$f":"IF('3.01.2'!G66=\"\",\"\",'3.01.2'!G66)","v":""},{"$f":"IF('3.01.2'!H66=\"\",\"\",'3.01.2'!H66)","v":""},{"$f":"IF('3.01.2'!I66=\"\",\"\",'3.01.2'!I66)","v":""},{"$f":"IF('3.01.2'!J66=\"\",\"\",'3.01.2'!J66)","v":""}]
["3.01.2",0,"",2019,{"$f":"'3.01.2'!A67","v":"56"},{"$f":"IF('3.01.2'!B67=\"\",\"\",'3.01.2'!B67)","v":""},{"$f":"IF('3.01.2'!C67=\"\",\"\",'3.01.2'!C67)","v":""},{"$f":"IF('3.01.2'!D67=\"\",\"\",'3.01.2'!D67)","v":""},{"$f":"IF('3.01.2'!E67=\"\",\"\",'3.01.2'!E67)","v":""},{"$f":"IF('3.01.2'!F67=\"\",\"\",'3.01.2'!F67)","v":""},{"$f":"IF('3.01.2'!G67=\"\",\"\",'3.01.2'!G67)","v":""},{"$f":"IF('3.01.2'!H67=\"\",\"\",'3.01.2'!H67)","v":""},{"$f":"IF('3.01.2'!I67=\"\",\"\",'3.01.2'!I67)","v":""},{"$f":"IF('3.01.2'!J67=\"\",\"\",'3.01.2'!J67)","v":""}]
["3.01.2",0,"",2019,{"$f":"'3.01.2'!A68","v":"57"},{"$f":"IF('3.01.2'!B68=\"\",\"\",'3.01.2'!B68)","v":""},{"$f":"IF('3.01.2'!C68=\"\",\"\",'3.01.2'!C68)","v":""},{"$f":"IF('3.01.2'!D68=\"\",\"\",'3.01.2'!D68)","v":""},{"$f":"IF('3.01.2'!E68=\"\",\"\",'3.01.2'!E68)","v":""},{"$f":"IF('3.01.2'!F68=\"\",\"\",'3.01.2'!F68)","v":""},{"$f":"IF('3.01.2'!G68=\"\",\"\",'3.01.2'!G68)","v":""},{"$f":"IF('3.01.2'!H68=\"\",\"\",'3.01.2'!H68)","v":""},{"$f":"IF('3.01.2'!I68=\"\",\"\",'3.01.2'!I68)","v":""},{"$f":"IF('3.01.2'!J68=\"\",\"\",'3.01.2'!J68)","v":""}]
["3.01.2",0,"",2019,{"$f":"'3.01.2'!A69","v":"58"},{"$f":"IF('3.01.2'!B69=\"\",\"\",'3.01.2'!B69)","v":""},{"$f":"IF('3.01.2'!C69=\"\",\"\",'3.01.2'!C69)","v":""},{"$f":"IF('3.01.2'!D69=\"\",\"\",'3.01.2'!D69)","v":""},{"$f":"IF('3.01.2'!E69=\"\",\"\",'3.01.2'!E69)","v":""},{"$f":"IF('3.01.2'!F69=\"\",\"\",'3.01.2'!F69)","v":""},{"$f":"IF('3.01.2'!G69=\"\",\"\",'3.01.2'!G69)","v":""},{"$f":"IF('3.01.2'!H69=\"\",\"\",'3.01.2'!H69)","v":""},{"$f":"IF('3.01.2'!I69=\"\",\"\",'3.01.2'!I69)","v":""},{"$f":"IF('3.01.2'!J69=\"\",\"\",'3.01.2'!J69)","v":""}]
["3.01.2",0,"",2019,{"$f":"'3.01.2'!A70","v":"59"},{"$f":"IF('3.01.2'!B70=\"\",\"\",'3.01.2'!B70)","v":""},{"$f":"IF('3.01.2'!C70=\"\",\"\",'3.01.2'!C70)","v":""},{"$f":"IF('3.01.2'!D70=\"\",\"\",'3.01.2'!D70)","v":""},{"$f":"IF('3.01.2'!E70=\"\",\"\",'3.01.2'!E70)","v":""},{"$f":"IF('3.01.2'!F70=\"\",\"\",'3.01.2'!F70)","v":""},{"$f":"IF('3.01.2'!G70=\"\",\"\",'3.01.2'!G70)","v":""},{"$f":"IF('3.01.2'!H70=\"\",\"\",'3.01.2'!H70)","v":""},{"$f":"IF('3.01.2'!I70=\"\",\"\",'3.01.2'!I70)","v":""},{"$f":"IF('3.01.2'!J70=\"\",\"\",'3.01.2'!J70)","v":""}]
["3.01.2",0,"",2019,{"$f":"'3.01.2'!A71","v":"60"},{"$f":"IF('3.01.2'!B71=\"\",\"\",'3.01.2'!B71)","v":""},{"$f":"IF('3.01.2'!C71=\"\",\"\",'3.01.2'!C71)","v":""},{"$f":"IF('3.01.2'!D71=\"\",\"\",'3.01.2'!D71)","v":""},{"$f":"IF('3.01.2'!E71=\"\",\"\",'3.01.2'!E71)","v":""},{"$f":"IF('3.01.2'!F71=\"\",\"\",'3.01.2'!F71)","v":""},{"$f":"IF('3.01.2'!G71=\"\",\"\",'3.01.2'!G71)","v":""},{"$f":"IF('3.01.2'!H71=\"\",\"\",'3.01.2'!H71)","v":""},{"$f":"IF('3.01.2'!I71=\"\",\"\",'3.01.2'!I71)","v":""},{"$f":"IF('3.01.2'!J71=\"\",\"\",'3.01.2'!J71)","v":""}]
["3.01.2",0,"",2019,{"$f":"'3.01.2'!A72","v":"61"},{"$f":"IF('3.01.2'!B72=\"\",\"\",'3.01.2'!B72)","v":""},{"$f":"IF('3.01.2'!C72=\"\",\"\",'3.01.2'!C72)","v":""},{"$f":"IF('3.01.2'!D72=\"\",\"\",'3.01.2'!D72)","v":""},{"$f":"IF('3.01.2'!E72=\"\",\"\",'3.01.2'!E72)","v":""},{"$f":"IF('3.01.2'!F72=\"\",\"\",'3.01.2'!F72)","v":""},{"$f":"IF('3.01.2'!G72=\"\",\"\",'3.01.2'!G72)","v":""},{"$f":"IF('3.01.2'!H72=\"\",\"\",'3.01.2'!H72)","v":""},{"$f":"IF('3.01.2'!I72=\"\",\"\",'3.01.2'!I72)","v":""},{"$f":"IF('3.01.2'!J72=\"\",\"\",'3.01.2'!J72)","v":""}]
["3.01.2",0,"",2019,{"$f":"'3.01.2'!A73","v":"62"},{"$f":"IF('3.01.2'!B73=\"\",\"\",'3.01.2'!B73)","v":""},{"$f":"IF('3.01.2'!C73=\"\",\"\",'3.01.2'!C73)","v":""},{"$f":"IF('3.01.2'!D73=\"\",\"\",'3.01.2'!D73)","v":""},{"$f":"IF('3.01.2'!E73=\"\",\"\",'3.01.2'!E73)","v":""},{"$f":"IF('3.01.2'!F73=\"\",\"\",'3.01.2'!F73)","v":""},{"$f":"IF('3.01.2'!G73=\"\",\"\",'3.01.2'!G73)","v":""},{"$f":"IF('3.01.2'!H73=\"\",\"\",'3.01.2'!H73)","v":""},{"$f":"IF('3.01.2'!I73=\"\",\"\",'3.01.2'!I73)","v":""},{"$f":"IF('3.01.2'!J73=\"\",\"\",'3.01.2'!J73)","v":""}]
["3.01.2",0,"",2019,{"$f":"'3.01.2'!A74","v":"63"},{"$f":"IF('3.01.2'!B74=\"\",\"\",'3.01.2'!B74)","v":""},{"$f":"IF('3.01.2'!C74=\"\",\"\",'3.01.2'!C74)","v":""},{"$f":"IF('3.01.2'!D74=\"\",\"\",'3.01.2'!D74)","v":""},{"$f":"IF('3.01.2'!E74=\"\",\"\",'3.01.2'!E74)","v":""},{"$f":"IF('3.01.2'!F74=\"\",\"\",'3.01.2'!F74)","v":""},{"$f":"IF('3.01.2'!G74=\"\",\"\",'3.01.2'!G74)","v":""},{"$f":"IF('3.01.2'!H74=\"\",\"\",'3.01.2'!H74)","v":""},{"$f":"IF('3.01.2'!I74=\"\",\"\",'3.01.2'!I74)","v":""},{"$f":"IF('3.01.2'!J74=\"\",\"\",'3.01.2'!J74)","v":""}]
["3.01.2",0,"",2019,{"$f":"'3.01.2'!A75","v":"64"},{"$f":"IF('3.01.2'!B75=\"\",\"\",'3.01.2'!B75)","v":""},{"$f":"IF('3.01.2'!C75=\"\",\"\",'3.01.2'!C75)","v":""},{"$f":"IF('3.01.2'!D75=\"\",\"\",'3.01.2'!D75)","v":""},{"$f":"IF('3.01.2'!E75=\"\",\"\",'3.01.2'!E75)","v":""},{"$f":"IF('3.01.2'!F75=\"\",\"\",'3.01.2'!F75)","v":""},{"$f":"IF('3.01.2'!G75=\"\",\"\",'3.01.2'!G75)","v":""},{"$f":"IF('3.01.2'!H75=\"\",\"\",'3.01.2'!H75)","v":""},{"$f":"IF('3.01.2'!I75=\"\",\"\",'3.01.2'!I75)","v":""},{"$f":"IF('3.01.2'!J75=\"\",\"\",'3.01.2'!J75)","v":""}]
["3.01.2",0,"",2019,{"$f":"'3.01.2'!A76","v":"65"},{"$f":"IF('3.01.2'!B76=\"\",\"\",'3.01.2'!B76)","v":""},{"$f":"IF('3.01.2'!C76=\"\",\"\",'3.01.2'!C76)","v":""},{"$f":"IF('3.01.2'!D76=\"\",\"\",'3.01.2'!D76)","v":""},{"$f":"IF('3.01.2'!E76=\"\",\"\",'3.01.2'!E76)","v":""},{"$f":"IF('3.01.2'!F76=\"\",\"\",'3.01.2'!F76)","v":""},{"$f":"IF('3.01.2'!G76=\"\",\"\",'3.01.2'!G76)","v":""},{"$f":"IF('3.01.2'!H76=\"\",\"\",'3.01.2'!H76)","v":""},{"$f":"IF('3.01.2'!I76=\"\",\"\",'3.01.2'!I76)","v":""},{"$f":"IF('3.01.2'!J76=\"\",\"\",'3.01.2'!J76)","v":""}]
["3.01.2",0,"",2019,{"$f":"'3.01.2'!A77","v":"66"},{"$f":"IF('3.01.2'!B77=\"\",\"\",'3.01.2'!B77)","v":""},{"$f":"IF('3.01.2'!C77=\"\",\"\",'3.01.2'!C77)","v":""},{"$f":"IF('3.01.2'!D77=\"\",\"\",'3.01.2'!D77)","v":""},{"$f":"IF('3.01.2'!E77=\"\",\"\",'3.01.2'!E77)","v":""},{"$f":"IF('3.01.2'!F77=\"\",\"\",'3.01.2'!F77)","v":""},{"$f":"IF('3.01.2'!G77=\"\",\"\",'3.01.2'!G77)","v":""},{"$f":"IF('3.01.2'!H77=\"\",\"\",'3.01.2'!H77)","v":""},{"$f":"IF('3.01.2'!I77=\"\",\"\",'3.01.2'!I77)","v":""},{"$f":"IF('3.01.2'!J77=\"\",\"\",'3.01.2'!J77)","v":""}]
["3.01.2",0,"",2019,{"$f":"'3.01.2'!A78","v":"67"},{"$f":"IF('3.01.2'!B78=\"\",\"\",'3.01.2'!B78)","v":""},{"$f":"IF('3.01.2'!C78=\"\",\"\",'3.01.2'!C78)","v":""},{"$f":"IF('3.01.2'!D78=\"\",\"\",'3.01.2'!D78)","v":""},{"$f":"IF('3.01.2'!E78=\"\",\"\",'3.01.2'!E78)","v":""},{"$f":"IF('3.01.2'!F78=\"\",\"\",'3.01.2'!F78)","v":""},{"$f":"IF('3.01.2'!G78=\"\",\"\",'3.01.2'!G78)","v":""},{"$f":"IF('3.01.2'!H78=\"\",\"\",'3.01.2'!H78)","v":""},{"$f":"IF('3.01.2'!I78=\"\",\"\",'3.01.2'!I78)","v":""},{"$f":"IF('3.01.2'!J78=\"\",\"\",'3.01.2'!J78)","v":""}]
["3.01.2",0,"",2019,{"$f":"'3.01.2'!A79","v":"68"},{"$f":"IF('3.01.2'!B79=\"\",\"\",'3.01.2'!B79)","v":""},{"$f":"IF('3.01.2'!C79=\"\",\"\",'3.01.2'!C79)","v":""},{"$f":"IF('3.01.2'!D79=\"\",\"\",'3.01.2'!D79)","v":""},{"$f":"IF('3.01.2'!E79=\"\",\"\",'3.01.2'!E79)","v":""},{"$f":"IF('3.01.2'!F79=\"\",\"\",'3.01.2'!F79)","v":""},{"$f":"IF('3.01.2'!G79=\"\",\"\",'3.01.2'!G79)","v":""},{"$f":"IF('3.01.2'!H79=\"\",\"\",'3.01.2'!H79)","v":""},{"$f":"IF('3.01.2'!I79=\"\",\"\",'3.01.2'!I79)","v":""},{"$f":"IF('3.01.2'!J79=\"\",\"\",'3.01.2'!J79)","v":""}]
["3.01.2",0,"",2019,{"$f":"'3.01.2'!A80","v":"69"},{"$f":"IF('3.01.2'!B80=\"\",\"\",'3.01.2'!B80)","v":""},{"$f":"IF('3.01.2'!C80=\"\",\"\",'3.01.2'!C80)","v":""},{"$f":"IF('3.01.2'!D80=\"\",\"\",'3.01.2'!D80)","v":""},{"$f":"IF('3.01.2'!E80=\"\",\"\",'3.01.2'!E80)","v":""},{"$f":"IF('3.01.2'!F80=\"\",\"\",'3.01.2'!F80)","v":""},{"$f":"IF('3.01.2'!G80=\"\",\"\",'3.01.2'!G80)","v":""},{"$f":"IF('3.01.2'!H80=\"\",\"\",'3.01.2'!H80)","v":""},{"$f":"IF('3.01.2'!I80=\"\",\"\",'3.01.2'!I80)","v":""},{"$f":"IF('3.01.2'!J80=\"\",\"\",'3.01.2'!J80)","v":""}]
["3.01.2",0,"",2019,{"$f":"'3.01.2'!A81","v":"70"},{"$f":"IF('3.01.2'!B81=\"\",\"\",'3.01.2'!B81)","v":""},{"$f":"IF('3.01.2'!C81=\"\",\"\",'3.01.2'!C81)","v":""},{"$f":"IF('3.01.2'!D81=\"\",\"\",'3.01.2'!D81)","v":""},{"$f":"IF('3.01.2'!E81=\"\",\"\",'3.01.2'!E81)","v":""},{"$f":"IF('3.01.2'!F81=\"\",\"\",'3.01.2'!F81)","v":""},{"$f":"IF('3.01.2'!G81=\"\",\"\",'3.01.2'!G81)","v":""},{"$f":"IF('3.01.2'!H81=\"\",\"\",'3.01.2'!H81)","v":""},{"$f":"IF('3.01.2'!I81=\"\",\"\",'3.01.2'!I81)","v":""},{"$f":"IF('3.01.2'!J81=\"\",\"\",'3.01.2'!J81)","v":""}]
["3.01.3",{"$f":"AgencyCode","v":0},{"$f":"AgencyName","v":""},2019,1,{"$f":"IF('3.01.3'!G11=\"\",\"\",'3.01.3'!G11)","v":""}]
["3.01.3",0,"",2019,"1.a",{"$f":"IF('3.01.3'!H10=\"\",\"\",'3.01.3'!H10)","v":""}]
["3.01.3",0,"",2019,{"$f":"'3.01.3'!A17","v":"01"},{"$f":"IF('3.01.3'!B17=\"\",\"\",'3.01.3'!B17)","v":""},{"$f":"IF('3.01.3'!C17=\"\",\"\",'3.01.3'!C17)","v":""},{"$f":"IF('3.01.3'!D17=\"\",\"\",'3.01.3'!D17)","v":""},{"$f":"IF('3.01.3'!E17=\"\",\"\",'3.01.3'!E17)","v":""},{"$f":"IF('3.01.3'!F17=\"\",\"\",'3.01.3'!F17)","v":""},{"$f":"IF('3.01.3'!G17=\"\",\"\",'3.01.3'!G17)","v":""},{"$f":"IF('3.01.3'!H17=\"\",\"\",'3.01.3'!H17)","v":""},{"$f":"IF('3.01.3'!I17=\"\",\"\",'3.01.3'!I17)","v":""},{"$f":"IF('3.01.3'!J17=\"\",\"\",'3.01.3'!J17)","v":""},{"$f":"IF('3.01.3'!K17=\"\",\"\",'3.01.3'!K17)","v":""},{"$f":"IF('3.01.3'!L17=\"\",\"\",'3.01.3'!L17)","v":""},{"$f":"IF('3.01.3'!M17=\"\",\"\",'3.01.3'!M17)","v":""},{"$f":"IF('3.01.3'!N17=\"\",\"\",'3.01.3'!N17)","v":""}]
["3.01.3",0,"",2019,{"$f":"'3.01.3'!A18","v":"02"},{"$f":"IF('3.01.3'!B18=\"\",\"\",'3.01.3'!B18)","v":""},{"$f":"IF('3.01.3'!C18=\"\",\"\",'3.01.3'!C18)","v":""},{"$f":"IF('3.01.3'!D18=\"\",\"\",'3.01.3'!D18)","v":""},{"$f":"IF('3.01.3'!E18=\"\",\"\",'3.01.3'!E18)","v":""},{"$f":"IF('3.01.3'!F18=\"\",\"\",'3.01.3'!F18)","v":""},{"$f":"IF('3.01.3'!G18=\"\",\"\",'3.01.3'!G18)","v":""},{"$f":"IF('3.01.3'!H18=\"\",\"\",'3.01.3'!H18)","v":""},{"$f":"IF('3.01.3'!I18=\"\",\"\",'3.01.3'!I18)","v":""},{"$f":"IF('3.01.3'!J18=\"\",\"\",'3.01.3'!J18)","v":""},{"$f":"IF('3.01.3'!K18=\"\",\"\",'3.01.3'!K18)","v":""},{"$f":"IF('3.01.3'!L18=\"\",\"\",'3.01.3'!L18)","v":""},{"$f":"IF('3.01.3'!M18=\"\",\"\",'3.01.3'!M18)","v":""},{"$f":"IF('3.01.3'!N18=\"\",\"\",'3.01.3'!N18)","v":""}]
["3.01.3",0,"",2019,{"$f":"'3.01.3'!A19","v":"03"},{"$f":"IF('3.01.3'!B19=\"\",\"\",'3.01.3'!B19)","v":""},{"$f":"IF('3.01.3'!C19=\"\",\"\",'3.01.3'!C19)","v":""},{"$f":"IF('3.01.3'!D19=\"\",\"\",'3.01.3'!D19)","v":""},{"$f":"IF('3.01.3'!E19=\"\",\"\",'3.01.3'!E19)","v":""},{"$f":"IF('3.01.3'!F19=\"\",\"\",'3.01.3'!F19)","v":""},{"$f":"IF('3.01.3'!G19=\"\",\"\",'3.01.3'!G19)","v":""},{"$f":"IF('3.01.3'!H19=\"\",\"\",'3.01.3'!H19)","v":""},{"$f":"IF('3.01.3'!I19=\"\",\"\",'3.01.3'!I19)","v":""},{"$f":"IF('3.01.3'!J19=\"\",\"\",'3.01.3'!J19)","v":""},{"$f":"IF('3.01.3'!K19=\"\",\"\",'3.01.3'!K19)","v":""},{"$f":"IF('3.01.3'!L19=\"\",\"\",'3.01.3'!L19)","v":""},{"$f":"IF('3.01.3'!M19=\"\",\"\",'3.01.3'!M19)","v":""},{"$f":"IF('3.01.3'!N19=\"\",\"\",'3.01.3'!N19)","v":""}]
["3.01.3",0,"",2019,{"$f":"'3.01.3'!A20","v":"04"},{"$f":"IF('3.01.3'!B20=\"\",\"\",'3.01.3'!B20)","v":""},{"$f":"IF('3.01.3'!C20=\"\",\"\",'3.01.3'!C20)","v":""},{"$f":"IF('3.01.3'!D20=\"\",\"\",'3.01.3'!D20)","v":""},{"$f":"IF('3.01.3'!E20=\"\",\"\",'3.01.3'!E20)","v":""},{"$f":"IF('3.01.3'!F20=\"\",\"\",'3.01.3'!F20)","v":""},{"$f":"IF('3.01.3'!G20=\"\",\"\",'3.01.3'!G20)","v":""},{"$f":"IF('3.01.3'!H20=\"\",\"\",'3.01.3'!H20)","v":""},{"$f":"IF('3.01.3'!I20=\"\",\"\",'3.01.3'!I20)","v":""},{"$f":"IF('3.01.3'!J20=\"\",\"\",'3.01.3'!J20)","v":""},{"$f":"IF('3.01.3'!K20=\"\",\"\",'3.01.3'!K20)","v":""},{"$f":"IF('3.01.3'!L20=\"\",\"\",'3.01.3'!L20)","v":""},{"$f":"IF('3.01.3'!M20=\"\",\"\",'3.01.3'!M20)","v":""},{"$f":"IF('3.01.3'!N20=\"\",\"\",'3.01.3'!N20)","v":""}]
["3.01.3",0,"",2019,{"$f":"'3.01.3'!A21","v":"05"},{"$f":"IF('3.01.3'!B21=\"\",\"\",'3.01.3'!B21)","v":""},{"$f":"IF('3.01.3'!C21=\"\",\"\",'3.01.3'!C21)","v":""},{"$f":"IF('3.01.3'!D21=\"\",\"\",'3.01.3'!D21)","v":""},{"$f":"IF('3.01.3'!E21=\"\",\"\",'3.01.3'!E21)","v":""},{"$f":"IF('3.01.3'!F21=\"\",\"\",'3.01.3'!F21)","v":""},{"$f":"IF('3.01.3'!G21=\"\",\"\",'3.01.3'!G21)","v":""},{"$f":"IF('3.01.3'!H21=\"\",\"\",'3.01.3'!H21)","v":""},{"$f":"IF('3.01.3'!I21=\"\",\"\",'3.01.3'!I21)","v":""},{"$f":"IF('3.01.3'!J21=\"\",\"\",'3.01.3'!J21)","v":""},{"$f":"IF('3.01.3'!K21=\"\",\"\",'3.01.3'!K21)","v":""},{"$f":"IF('3.01.3'!L21=\"\",\"\",'3.01.3'!L21)","v":""},{"$f":"IF('3.01.3'!M21=\"\",\"\",'3.01.3'!M21)","v":""},{"$f":"IF('3.01.3'!N21=\"\",\"\",'3.01.3'!N21)","v":""}]
["3.01.3",0,"",2019,{"$f":"'3.01.3'!A22","v":"06"},{"$f":"IF('3.01.3'!B22=\"\",\"\",'3.01.3'!B22)","v":""},{"$f":"IF('3.01.3'!C22=\"\",\"\",'3.01.3'!C22)","v":""},{"$f":"IF('3.01.3'!D22=\"\",\"\",'3.01.3'!D22)","v":""},{"$f":"IF('3.01.3'!E22=\"\",\"\",'3.01.3'!E22)","v":""},{"$f":"IF('3.01.3'!F22=\"\",\"\",'3.01.3'!F22)","v":""},{"$f":"IF('3.01.3'!G22=\"\",\"\",'3.01.3'!G22)","v":""},{"$f":"IF('3.01.3'!H22=\"\",\"\",'3.01.3'!H22)","v":""},{"$f":"IF('3.01.3'!I22=\"\",\"\",'3.01.3'!I22)","v":""},{"$f":"IF('3.01.3'!J22=\"\",\"\",'3.01.3'!J22)","v":""},{"$f":"IF('3.01.3'!K22=\"\",\"\",'3.01.3'!K22)","v":""},{"$f":"IF('3.01.3'!L22=\"\",\"\",'3.01.3'!L22)","v":""},{"$f":"IF('3.01.3'!M22=\"\",\"\",'3.01.3'!M22)","v":""},{"$f":"IF('3.01.3'!N22=\"\",\"\",'3.01.3'!N22)","v":""}]
["3.01.3",0,"",2019,{"$f":"'3.01.3'!A23","v":"07"},{"$f":"IF('3.01.3'!B23=\"\",\"\",'3.01.3'!B23)","v":""},{"$f":"IF('3.01.3'!C23=\"\",\"\",'3.01.3'!C23)","v":""},{"$f":"IF('3.01.3'!D23=\"\",\"\",'3.01.3'!D23)","v":""},{"$f":"IF('3.01.3'!E23=\"\",\"\",'3.01.3'!E23)","v":""},{"$f":"IF('3.01.3'!F23=\"\",\"\",'3.01.3'!F23)","v":""},{"$f":"IF('3.01.3'!G23=\"\",\"\",'3.01.3'!G23)","v":""},{"$f":"IF('3.01.3'!H23=\"\",\"\",'3.01.3'!H23)","v":""},{"$f":"IF('3.01.3'!I23=\"\",\"\",'3.01.3'!I23)","v":""},{"$f":"IF('3.01.3'!J23=\"\",\"\",'3.01.3'!J23)","v":""},{"$f":"IF('3.01.3'!K23=\"\",\"\",'3.01.3'!K23)","v":""},{"$f":"IF('3.01.3'!L23=\"\",\"\",'3.01.3'!L23)","v":""},{"$f":"IF('3.01.3'!M23=\"\",\"\",'3.01.3'!M23)","v":""},{"$f":"IF('3.01.3'!N23=\"\",\"\",'3.01.3'!N23)","v":""}]
["3.01.3",0,"",2019,{"$f":"'3.01.3'!A24","v":"08"},{"$f":"IF('3.01.3'!B24=\"\",\"\",'3.01.3'!B24)","v":""},{"$f":"IF('3.01.3'!C24=\"\",\"\",'3.01.3'!C24)","v":""},{"$f":"IF('3.01.3'!D24=\"\",\"\",'3.01.3'!D24)","v":""},{"$f":"IF('3.01.3'!E24=\"\",\"\",'3.01.3'!E24)","v":""},{"$f":"IF('3.01.3'!F24=\"\",\"\",'3.01.3'!F24)","v":""},{"$f":"IF('3.01.3'!G24=\"\",\"\",'3.01.3'!G24)","v":""},{"$f":"IF('3.01.3'!H24=\"\",\"\",'3.01.3'!H24)","v":""},{"$f":"IF('3.01.3'!I24=\"\",\"\",'3.01.3'!I24)","v":""},{"$f":"IF('3.01.3'!J24=\"\",\"\",'3.01.3'!J24)","v":""},{"$f":"IF('3.01.3'!K24=\"\",\"\",'3.01.3'!K24)","v":""},{"$f":"IF('3.01.3'!L24=\"\",\"\",'3.01.3'!L24)","v":""},{"$f":"IF('3.01.3'!M24=\"\",\"\",'3.01.3'!M24)","v":""},{"$f":"IF('3.01.3'!N24=\"\",\"\",'3.01.3'!N24)","v":""}]
["3.01.3",0,"",2019,{"$f":"'3.01.3'!A25","v":"09"},{"$f":"IF('3.01.3'!B25=\"\",\"\",'3.01.3'!B25)","v":""},{"$f":"IF('3.01.3'!C25=\"\",\"\",'3.01.3'!C25)","v":""},{"$f":"IF('3.01.3'!D25=\"\",\"\",'3.01.3'!D25)","v":""},{"$f":"IF('3.01.3'!E25=\"\",\"\",'3.01.3'!E25)","v":""},{"$f":"IF('3.01.3'!F25=\"\",\"\",'3.01.3'!F25)","v":""},{"$f":"IF('3.01.3'!G25=\"\",\"\",'3.01.3'!G25)","v":""},{"$f":"IF('3.01.3'!H25=\"\",\"\",'3.01.3'!H25)","v":""},{"$f":"IF('3.01.3'!I25=\"\",\"\",'3.01.3'!I25)","v":""},{"$f":"IF('3.01.3'!J25=\"\",\"\",'3.01.3'!J25)","v":""},{"$f":"IF('3.01.3'!K25=\"\",\"\",'3.01.3'!K25)","v":""},{"$f":"IF('3.01.3'!L25=\"\",\"\",'3.01.3'!L25)","v":""},{"$f":"IF('3.01.3'!M25=\"\",\"\",'3.01.3'!M25)","v":""},{"$f":"IF('3.01.3'!N25=\"\",\"\",'3.01.3'!N25)","v":""}]
["3.01.3",0,"",2019,{"$f":"'3.01.3'!A26","v":"10"},{"$f":"IF('3.01.3'!B26=\"\",\"\",'3.01.3'!B26)","v":""},{"$f":"IF('3.01.3'!C26=\"\",\"\",'3.01.3'!C26)","v":""},{"$f":"IF('3.01.3'!D26=\"\",\"\",'3.01.3'!D26)","v":""},{"$f":"IF('3.01.3'!E26=\"\",\"\",'3.01.3'!E26)","v":""},{"$f":"IF('3.01.3'!F26=\"\",\"\",'3.01.3'!F26)","v":""},{"$f":"IF('3.01.3'!G26=\"\",\"\",'3.01.3'!G26)","v":""},{"$f":"IF('3.01.3'!H26=\"\",\"\",'3.01.3'!H26)","v":""},{"$f":"IF('3.01.3'!I26=\"\",\"\",'3.01.3'!I26)","v":""},{"$f":"IF('3.01.3'!J26=\"\",\"\",'3.01.3'!J26)","v":""},{"$f":"IF('3.01.3'!K26=\"\",\"\",'3.01.3'!K26)","v":""},{"$f":"IF('3.01.3'!L26=\"\",\"\",'3.01.3'!L26)","v":""},{"$f":"IF('3.01.3'!M26=\"\",\"\",'3.01.3'!M26)","v":""},{"$f":"IF('3.01.3'!N26=\"\",\"\",'3.01.3'!N26)","v":""}]
["3.01.3",0,"",2019,{"$f":"'3.01.3'!A27","v":"11"},{"$f":"IF('3.01.3'!B27=\"\",\"\",'3.01.3'!B27)","v":""},{"$f":"IF('3.01.3'!C27=\"\",\"\",'3.01.3'!C27)","v":""},{"$f":"IF('3.01.3'!D27=\"\",\"\",'3.01.3'!D27)","v":""},{"$f":"IF('3.01.3'!E27=\"\",\"\",'3.01.3'!E27)","v":""},{"$f":"IF('3.01.3'!F27=\"\",\"\",'3.01.3'!F27)","v":""},{"$f":"IF('3.01.3'!G27=\"\",\"\",'3.01.3'!G27)","v":""},{"$f":"IF('3.01.3'!H27=\"\",\"\",'3.01.3'!H27)","v":""},{"$f":"IF('3.01.3'!I27=\"\",\"\",'3.01.3'!I27)","v":""},{"$f":"IF('3.01.3'!J27=\"\",\"\",'3.01.3'!J27)","v":""},{"$f":"IF('3.01.3'!K27=\"\",\"\",'3.01.3'!K27)","v":""},{"$f":"IF('3.01.3'!L27=\"\",\"\",'3.01.3'!L27)","v":""},{"$f":"IF('3.01.3'!M27=\"\",\"\",'3.01.3'!M27)","v":""},{"$f":"IF('3.01.3'!N27=\"\",\"\",'3.01.3'!N27)","v":""}]
["3.01.3",0,"",2019,{"$f":"'3.01.3'!A28","v":"12"},{"$f":"IF('3.01.3'!B28=\"\",\"\",'3.01.3'!B28)","v":""},{"$f":"IF('3.01.3'!C28=\"\",\"\",'3.01.3'!C28)","v":""},{"$f":"IF('3.01.3'!D28=\"\",\"\",'3.01.3'!D28)","v":""},{"$f":"IF('3.01.3'!E28=\"\",\"\",'3.01.3'!E28)","v":""},{"$f":"IF('3.01.3'!F28=\"\",\"\",'3.01.3'!F28)","v":""},{"$f":"IF('3.01.3'!G28=\"\",\"\",'3.01.3'!G28)","v":""},{"$f":"IF('3.01.3'!H28=\"\",\"\",'3.01.3'!H28)","v":""},{"$f":"IF('3.01.3'!I28=\"\",\"\",'3.01.3'!I28)","v":""},{"$f":"IF('3.01.3'!J28=\"\",\"\",'3.01.3'!J28)","v":""},{"$f":"IF('3.01.3'!K28=\"\",\"\",'3.01.3'!K28)","v":""},{"$f":"IF('3.01.3'!L28=\"\",\"\",'3.01.3'!L28)","v":""},{"$f":"IF('3.01.3'!M28=\"\",\"\",'3.01.3'!M28)","v":""},{"$f":"IF('3.01.3'!N28=\"\",\"\",'3.01.3'!N28)","v":""}]
["3.01.3",0,"",2019,{"$f":"'3.01.3'!A29","v":"13"},{"$f":"IF('3.01.3'!B29=\"\",\"\",'3.01.3'!B29)","v":""},{"$f":"IF('3.01.3'!C29=\"\",\"\",'3.01.3'!C29)","v":""},{"$f":"IF('3.01.3'!D29=\"\",\"\",'3.01.3'!D29)","v":""},{"$f":"IF('3.01.3'!E29=\"\",\"\",'3.01.3'!E29)","v":""},{"$f":"IF('3.01.3'!F29=\"\",\"\",'3.01.3'!F29)","v":""},{"$f":"IF('3.01.3'!G29=\"\",\"\",'3.01.3'!G29)","v":""},{"$f":"IF('3.01.3'!H29=\"\",\"\",'3.01.3'!H29)","v":""},{"$f":"IF('3.01.3'!I29=\"\",\"\",'3.01.3'!I29)","v":""},{"$f":"IF('3.01.3'!J29=\"\",\"\",'3.01.3'!J29)","v":""},{"$f":"IF('3.01.3'!K29=\"\",\"\",'3.01.3'!K29)","v":""},{"$f":"IF('3.01.3'!L29=\"\",\"\",'3.01.3'!L29)","v":""},{"$f":"IF('3.01.3'!M29=\"\",\"\",'3.01.3'!M29)","v":""},{"$f":"IF('3.01.3'!N29=\"\",\"\",'3.01.3'!N29)","v":""}]
["3.01.3",0,"",2019,{"$f":"'3.01.3'!A30","v":"14"},{"$f":"IF('3.01.3'!B30=\"\",\"\",'3.01.3'!B30)","v":""},{"$f":"IF('3.01.3'!C30=\"\",\"\",'3.01.3'!C30)","v":""},{"$f":"IF('3.01.3'!D30=\"\",\"\",'3.01.3'!D30)","v":""},{"$f":"IF('3.01.3'!E30=\"\",\"\",'3.01.3'!E30)","v":""},{"$f":"IF('3.01.3'!F30=\"\",\"\",'3.01.3'!F30)","v":""},{"$f":"IF('3.01.3'!G30=\"\",\"\",'3.01.3'!G30)","v":""},{"$f":"IF('3.01.3'!H30=\"\",\"\",'3.01.3'!H30)","v":""},{"$f":"IF('3.01.3'!I30=\"\",\"\",'3.01.3'!I30)","v":""},{"$f":"IF('3.01.3'!J30=\"\",\"\",'3.01.3'!J30)","v":""},{"$f":"IF('3.01.3'!K30=\"\",\"\",'3.01.3'!K30)","v":""},{"$f":"IF('3.01.3'!L30=\"\",\"\",'3.01.3'!L30)","v":""},{"$f":"IF('3.01.3'!M30=\"\",\"\",'3.01.3'!M30)","v":""},{"$f":"IF('3.01.3'!N30=\"\",\"\",'3.01.3'!N30)","v":""}]
["3.01.3",0,"",2019,{"$f":"'3.01.3'!A31","v":"15"},{"$f":"IF('3.01.3'!B31=\"\",\"\",'3.01.3'!B31)","v":""},{"$f":"IF('3.01.3'!C31=\"\",\"\",'3.01.3'!C31)","v":""},{"$f":"IF('3.01.3'!D31=\"\",\"\",'3.01.3'!D31)","v":""},{"$f":"IF('3.01.3'!E31=\"\",\"\",'3.01.3'!E31)","v":""},{"$f":"IF('3.01.3'!F31=\"\",\"\",'3.01.3'!F31)","v":""},{"$f":"IF('3.01.3'!G31=\"\",\"\",'3.01.3'!G31)","v":""},{"$f":"IF('3.01.3'!H31=\"\",\"\",'3.01.3'!H31)","v":""},{"$f":"IF('3.01.3'!I31=\"\",\"\",'3.01.3'!I31)","v":""},{"$f":"IF('3.01.3'!J31=\"\",\"\",'3.01.3'!J31)","v":""},{"$f":"IF('3.01.3'!K31=\"\",\"\",'3.01.3'!K31)","v":""},{"$f":"IF('3.01.3'!L31=\"\",\"\",'3.01.3'!L31)","v":""},{"$f":"IF('3.01.3'!M31=\"\",\"\",'3.01.3'!M31)","v":""},{"$f":"IF('3.01.3'!N31=\"\",\"\",'3.01.3'!N31)","v":""}]
["3.01.3",0,"",2019,{"$f":"'3.01.3'!A32","v":"16"},{"$f":"IF('3.01.3'!B32=\"\",\"\",'3.01.3'!B32)","v":""},{"$f":"IF('3.01.3'!C32=\"\",\"\",'3.01.3'!C32)","v":""},{"$f":"IF('3.01.3'!D32=\"\",\"\",'3.01.3'!D32)","v":""},{"$f":"IF('3.01.3'!E32=\"\",\"\",'3.01.3'!E32)","v":""},{"$f":"IF('3.01.3'!F32=\"\",\"\",'3.01.3'!F32)","v":""},{"$f":"IF('3.01.3'!G32=\"\",\"\",'3.01.3'!G32)","v":""},{"$f":"IF('3.01.3'!H32=\"\",\"\",'3.01.3'!H32)","v":""},{"$f":"IF('3.01.3'!I32=\"\",\"\",'3.01.3'!I32)","v":""},{"$f":"IF('3.01.3'!J32=\"\",\"\",'3.01.3'!J32)","v":""},{"$f":"IF('3.01.3'!K32=\"\",\"\",'3.01.3'!K32)","v":""},{"$f":"IF('3.01.3'!L32=\"\",\"\",'3.01.3'!L32)","v":""},{"$f":"IF('3.01.3'!M32=\"\",\"\",'3.01.3'!M32)","v":""},{"$f":"IF('3.01.3'!N32=\"\",\"\",'3.01.3'!N32)","v":""}]
["3.01.3",0,"",2019,{"$f":"'3.01.3'!A33","v":"17"},{"$f":"IF('3.01.3'!B33=\"\",\"\",'3.01.3'!B33)","v":""},{"$f":"IF('3.01.3'!C33=\"\",\"\",'3.01.3'!C33)","v":""},{"$f":"IF('3.01.3'!D33=\"\",\"\",'3.01.3'!D33)","v":""},{"$f":"IF('3.01.3'!E33=\"\",\"\",'3.01.3'!E33)","v":""},{"$f":"IF('3.01.3'!F33=\"\",\"\",'3.01.3'!F33)","v":""},{"$f":"IF('3.01.3'!G33=\"\",\"\",'3.01.3'!G33)","v":""},{"$f":"IF('3.01.3'!H33=\"\",\"\",'3.01.3'!H33)","v":""},{"$f":"IF('3.01.3'!I33=\"\",\"\",'3.01.3'!I33)","v":""},{"$f":"IF('3.01.3'!J33=\"\",\"\",'3.01.3'!J33)","v":""},{"$f":"IF('3.01.3'!K33=\"\",\"\",'3.01.3'!K33)","v":""},{"$f":"IF('3.01.3'!L33=\"\",\"\",'3.01.3'!L33)","v":""},{"$f":"IF('3.01.3'!M33=\"\",\"\",'3.01.3'!M33)","v":""},{"$f":"IF('3.01.3'!N33=\"\",\"\",'3.01.3'!N33)","v":""}]
["3.01.3",0,"",2019,{"$f":"'3.01.3'!A34","v":"18"},{"$f":"IF('3.01.3'!B34=\"\",\"\",'3.01.3'!B34)","v":""},{"$f":"IF('3.01.3'!C34=\"\",\"\",'3.01.3'!C34)","v":""},{"$f":"IF('3.01.3'!D34=\"\",\"\",'3.01.3'!D34)","v":""},{"$f":"IF('3.01.3'!E34=\"\",\"\",'3.01.3'!E34)","v":""},{"$f":"IF('3.01.3'!F34=\"\",\"\",'3.01.3'!F34)","v":""},{"$f":"IF('3.01.3'!G34=\"\",\"\",'3.01.3'!G34)","v":""},{"$f":"IF('3.01.3'!H34=\"\",\"\",'3.01.3'!H34)","v":""},{"$f":"IF('3.01.3'!I34=\"\",\"\",'3.01.3'!I34)","v":""},{"$f":"IF('3.01.3'!J34=\"\",\"\",'3.01.3'!J34)","v":""},{"$f":"IF('3.01.3'!K34=\"\",\"\",'3.01.3'!K34)","v":""},{"$f":"IF('3.01.3'!L34=\"\",\"\",'3.01.3'!L34)","v":""},{"$f":"IF('3.01.3'!M34=\"\",\"\",'3.01.3'!M34)","v":""},{"$f":"IF('3.01.3'!N34=\"\",\"\",'3.01.3'!N34)","v":""}]
["3.01.3",0,"",2019,{"$f":"'3.01.3'!A35","v":"19"},{"$f":"IF('3.01.3'!B35=\"\",\"\",'3.01.3'!B35)","v":""},{"$f":"IF('3.01.3'!C35=\"\",\"\",'3.01.3'!C35)","v":""},{"$f":"IF('3.01.3'!D35=\"\",\"\",'3.01.3'!D35)","v":""},{"$f":"IF('3.01.3'!E35=\"\",\"\",'3.01.3'!E35)","v":""},{"$f":"IF('3.01.3'!F35=\"\",\"\",'3.01.3'!F35)","v":""},{"$f":"IF('3.01.3'!G35=\"\",\"\",'3.01.3'!G35)","v":""},{"$f":"IF('3.01.3'!H35=\"\",\"\",'3.01.3'!H35)","v":""},{"$f":"IF('3.01.3'!I35=\"\",\"\",'3.01.3'!I35)","v":""},{"$f":"IF('3.01.3'!J35=\"\",\"\",'3.01.3'!J35)","v":""},{"$f":"IF('3.01.3'!K35=\"\",\"\",'3.01.3'!K35)","v":""},{"$f":"IF('3.01.3'!L35=\"\",\"\",'3.01.3'!L35)","v":""},{"$f":"IF('3.01.3'!M35=\"\",\"\",'3.01.3'!M35)","v":""},{"$f":"IF('3.01.3'!N35=\"\",\"\",'3.01.3'!N35)","v":""}]
["3.01.3",0,"",{"$f":"Year","v":2019},{"$f":"'3.01.3'!A36","v":"20"},{"$f":"IF('3.01.3'!B36=\"\",\"\",'3.01.3'!B36)","v":""},{"$f":"IF('3.01.3'!C36=\"\",\"\",'3.01.3'!C36)","v":""},{"$f":"IF('3.01.3'!D36=\"\",\"\",'3.01.3'!D36)","v":""},{"$f":"IF('3.01.3'!E36=\"\",\"\",'3.01.3'!E36)","v":""},{"$f":"IF('3.01.3'!F36=\"\",\"\",'3.01.3'!F36)","v":""},{"$f":"IF('3.01.3'!G36=\"\",\"\",'3.01.3'!G36)","v":""},{"$f":"IF('3.01.3'!H36=\"\",\"\",'3.01.3'!H36)","v":""},{"$f":"IF('3.01.3'!I36=\"\",\"\",'3.01.3'!I36)","v":""},{"$f":"IF('3.01.3'!J36=\"\",\"\",'3.01.3'!J36)","v":""},{"$f":"IF('3.01.3'!K36=\"\",\"\",'3.01.3'!K36)","v":""},{"$f":"IF('3.01.3'!L36=\"\",\"\",'3.01.3'!L36)","v":""},{"$f":"IF('3.01.3'!M36=\"\",\"\",'3.01.3'!M36)","v":""},{"$f":"IF('3.01.3'!N36=\"\",\"\",'3.01.3'!N36)","v":""}]
["3.01.3",0,"",2019,{"$f":"'3.01.3'!A37","v":"21"},{"$f":"IF('3.01.3'!B37=\"\",\"\",'3.01.3'!B37)","v":""},{"$f":"IF('3.01.3'!C37=\"\",\"\",'3.01.3'!C37)","v":""},{"$f":"IF('3.01.3'!D37=\"\",\"\",'3.01.3'!D37)","v":""},{"$f":"IF('3.01.3'!E37=\"\",\"\",'3.01.3'!E37)","v":""},{"$f":"IF('3.01.3'!F37=\"\",\"\",'3.01.3'!F37)","v":""},{"$f":"IF('3.01.3'!G37=\"\",\"\",'3.01.3'!G37)","v":""},{"$f":"IF('3.01.3'!H37=\"\",\"\",'3.01.3'!H37)","v":""},{"$f":"IF('3.01.3'!I37=\"\",\"\",'3.01.3'!I37)","v":""},{"$f":"IF('3.01.3'!J37=\"\",\"\",'3.01.3'!J37)","v":""},{"$f":"IF('3.01.3'!K37=\"\",\"\",'3.01.3'!K37)","v":""},{"$f":"IF('3.01.3'!L37=\"\",\"\",'3.01.3'!L37)","v":""},{"$f":"IF('3.01.3'!M37=\"\",\"\",'3.01.3'!M37)","v":""},{"$f":"IF('3.01.3'!N37=\"\",\"\",'3.01.3'!N37)","v":""}]
["3.01.3",0,"",2019,{"$f":"'3.01.3'!A38","v":"22"},{"$f":"IF('3.01.3'!B38=\"\",\"\",'3.01.3'!B38)","v":""},{"$f":"IF('3.01.3'!C38=\"\",\"\",'3.01.3'!C38)","v":""},{"$f":"IF('3.01.3'!D38=\"\",\"\",'3.01.3'!D38)","v":""},{"$f":"IF('3.01.3'!E38=\"\",\"\",'3.01.3'!E38)","v":""},{"$f":"IF('3.01.3'!F38=\"\",\"\",'3.01.3'!F38)","v":""},{"$f":"IF('3.01.3'!G38=\"\",\"\",'3.01.3'!G38)","v":""},{"$f":"IF('3.01.3'!H38=\"\",\"\",'3.01.3'!H38)","v":""},{"$f":"IF('3.01.3'!I38=\"\",\"\",'3.01.3'!I38)","v":""},{"$f":"IF('3.01.3'!J38=\"\",\"\",'3.01.3'!J38)","v":""},{"$f":"IF('3.01.3'!K38=\"\",\"\",'3.01.3'!K38)","v":""},{"$f":"IF('3.01.3'!L38=\"\",\"\",'3.01.3'!L38)","v":""},{"$f":"IF('3.01.3'!M38=\"\",\"\",'3.01.3'!M38)","v":""},{"$f":"IF('3.01.3'!N38=\"\",\"\",'3.01.3'!N38)","v":""}]
["3.01.3",0,"",2019,{"$f":"'3.01.3'!A39","v":"23"},{"$f":"IF('3.01.3'!B39=\"\",\"\",'3.01.3'!B39)","v":""},{"$f":"IF('3.01.3'!C39=\"\",\"\",'3.01.3'!C39)","v":""},{"$f":"IF('3.01.3'!D39=\"\",\"\",'3.01.3'!D39)","v":""},{"$f":"IF('3.01.3'!E39=\"\",\"\",'3.01.3'!E39)","v":""},{"$f":"IF('3.01.3'!F39=\"\",\"\",'3.01.3'!F39)","v":""},{"$f":"IF('3.01.3'!G39=\"\",\"\",'3.01.3'!G39)","v":""},{"$f":"IF('3.01.3'!H39=\"\",\"\",'3.01.3'!H39)","v":""},{"$f":"IF('3.01.3'!I39=\"\",\"\",'3.01.3'!I39)","v":""},{"$f":"IF('3.01.3'!J39=\"\",\"\",'3.01.3'!J39)","v":""},{"$f":"IF('3.01.3'!K39=\"\",\"\",'3.01.3'!K39)","v":""},{"$f":"IF('3.01.3'!L39=\"\",\"\",'3.01.3'!L39)","v":""},{"$f":"IF('3.01.3'!M39=\"\",\"\",'3.01.3'!M39)","v":""},{"$f":"IF('3.01.3'!N39=\"\",\"\",'3.01.3'!N39)","v":""}]
["3.01.3",0,"",2019,{"$f":"'3.01.3'!A40","v":"24"},{"$f":"IF('3.01.3'!B40=\"\",\"\",'3.01.3'!B40)","v":""},{"$f":"IF('3.01.3'!C40=\"\",\"\",'3.01.3'!C40)","v":""},{"$f":"IF('3.01.3'!D40=\"\",\"\",'3.01.3'!D40)","v":""},{"$f":"IF('3.01.3'!E40=\"\",\"\",'3.01.3'!E40)","v":""},{"$f":"IF('3.01.3'!F40=\"\",\"\",'3.01.3'!F40)","v":""},{"$f":"IF('3.01.3'!G40=\"\",\"\",'3.01.3'!G40)","v":""},{"$f":"IF('3.01.3'!H40=\"\",\"\",'3.01.3'!H40)","v":""},{"$f":"IF('3.01.3'!I40=\"\",\"\",'3.01.3'!I40)","v":""},{"$f":"IF('3.01.3'!J40=\"\",\"\",'3.01.3'!J40)","v":""},{"$f":"IF('3.01.3'!K40=\"\",\"\",'3.01.3'!K40)","v":""},{"$f":"IF('3.01.3'!L40=\"\",\"\",'3.01.3'!L40)","v":""},{"$f":"IF('3.01.3'!M40=\"\",\"\",'3.01.3'!M40)","v":""},{"$f":"IF('3.01.3'!N40=\"\",\"\",'3.01.3'!N40)","v":""}]
["3.01.3",0,"",2019,{"$f":"'3.01.3'!A41","v":"25"},{"$f":"IF('3.01.3'!B41=\"\",\"\",'3.01.3'!B41)","v":""},{"$f":"IF('3.01.3'!C41=\"\",\"\",'3.01.3'!C41)","v":""},{"$f":"IF('3.01.3'!D41=\"\",\"\",'3.01.3'!D41)","v":""},{"$f":"IF('3.01.3'!E41=\"\",\"\",'3.01.3'!E41)","v":""},{"$f":"IF('3.01.3'!F41=\"\",\"\",'3.01.3'!F41)","v":""},{"$f":"IF('3.01.3'!G41=\"\",\"\",'3.01.3'!G41)","v":""},{"$f":"IF('3.01.3'!H41=\"\",\"\",'3.01.3'!H41)","v":""},{"$f":"IF('3.01.3'!I41=\"\",\"\",'3.01.3'!I41)","v":""},{"$f":"IF('3.01.3'!J41=\"\",\"\",'3.01.3'!J41)","v":""},{"$f":"IF('3.01.3'!K41=\"\",\"\",'3.01.3'!K41)","v":""},{"$f":"IF('3.01.3'!L41=\"\",\"\",'3.01.3'!L41)","v":""},{"$f":"IF('3.01.3'!M41=\"\",\"\",'3.01.3'!M41)","v":""},{"$f":"IF('3.01.3'!N41=\"\",\"\",'3.01.3'!N41)","v":""}]
["3.01.3",0,"",2019,{"$f":"'3.01.3'!A42","v":"26"},{"$f":"IF('3.01.3'!B42=\"\",\"\",'3.01.3'!B42)","v":""},{"$f":"IF('3.01.3'!C42=\"\",\"\",'3.01.3'!C42)","v":""},{"$f":"IF('3.01.3'!D42=\"\",\"\",'3.01.3'!D42)","v":""},{"$f":"IF('3.01.3'!E42=\"\",\"\",'3.01.3'!E42)","v":""},{"$f":"IF('3.01.3'!F42=\"\",\"\",'3.01.3'!F42)","v":""},{"$f":"IF('3.01.3'!G42=\"\",\"\",'3.01.3'!G42)","v":""},{"$f":"IF('3.01.3'!H42=\"\",\"\",'3.01.3'!H42)","v":""},{"$f":"IF('3.01.3'!I42=\"\",\"\",'3.01.3'!I42)","v":""},{"$f":"IF('3.01.3'!J42=\"\",\"\",'3.01.3'!J42)","v":""},{"$f":"IF('3.01.3'!K42=\"\",\"\",'3.01.3'!K42)","v":""},{"$f":"IF('3.01.3'!L42=\"\",\"\",'3.01.3'!L42)","v":""},{"$f":"IF('3.01.3'!M42=\"\",\"\",'3.01.3'!M42)","v":""},{"$f":"IF('3.01.3'!N42=\"\",\"\",'3.01.3'!N42)","v":""}]
["3.01.3",0,"",2019,{"$f":"'3.01.3'!A43","v":"27"},{"$f":"IF('3.01.3'!B43=\"\",\"\",'3.01.3'!B43)","v":""},{"$f":"IF('3.01.3'!C43=\"\",\"\",'3.01.3'!C43)","v":""},{"$f":"IF('3.01.3'!D43=\"\",\"\",'3.01.3'!D43)","v":""},{"$f":"IF('3.01.3'!E43=\"\",\"\",'3.01.3'!E43)","v":""},{"$f":"IF('3.01.3'!F43=\"\",\"\",'3.01.3'!F43)","v":""},{"$f":"IF('3.01.3'!G43=\"\",\"\",'3.01.3'!G43)","v":""},{"$f":"IF('3.01.3'!H43=\"\",\"\",'3.01.3'!H43)","v":""},{"$f":"IF('3.01.3'!I43=\"\",\"\",'3.01.3'!I43)","v":""},{"$f":"IF('3.01.3'!J43=\"\",\"\",'3.01.3'!J43)","v":""},{"$f":"IF('3.01.3'!K43=\"\",\"\",'3.01.3'!K43)","v":""},{"$f":"IF('3.01.3'!L43=\"\",\"\",'3.01.3'!L43)","v":""},{"$f":"IF('3.01.3'!M43=\"\",\"\",'3.01.3'!M43)","v":""},{"$f":"IF('3.01.3'!N43=\"\",\"\",'3.01.3'!N43)","v":""}]
["3.01.3",0,"",2019,{"$f":"'3.01.3'!A44","v":"28"},{"$f":"IF('3.01.3'!B44=\"\",\"\",'3.01.3'!B44)","v":""},{"$f":"IF('3.01.3'!C44=\"\",\"\",'3.01.3'!C44)","v":""},{"$f":"IF('3.01.3'!D44=\"\",\"\",'3.01.3'!D44)","v":""},{"$f":"IF('3.01.3'!E44=\"\",\"\",'3.01.3'!E44)","v":""},{"$f":"IF('3.01.3'!F44=\"\",\"\",'3.01.3'!F44)","v":""},{"$f":"IF('3.01.3'!G44=\"\",\"\",'3.01.3'!G44)","v":""},{"$f":"IF('3.01.3'!H44=\"\",\"\",'3.01.3'!H44)","v":""},{"$f":"IF('3.01.3'!I44=\"\",\"\",'3.01.3'!I44)","v":""},{"$f":"IF('3.01.3'!J44=\"\",\"\",'3.01.3'!J44)","v":""},{"$f":"IF('3.01.3'!K44=\"\",\"\",'3.01.3'!K44)","v":""},{"$f":"IF('3.01.3'!L44=\"\",\"\",'3.01.3'!L44)","v":""},{"$f":"IF('3.01.3'!M44=\"\",\"\",'3.01.3'!M44)","v":""},{"$f":"IF('3.01.3'!N44=\"\",\"\",'3.01.3'!N44)","v":""}]
["3.01.3",0,"",2019,{"$f":"'3.01.3'!A45","v":"29"},{"$f":"IF('3.01.3'!B45=\"\",\"\",'3.01.3'!B45)","v":""},{"$f":"IF('3.01.3'!C45=\"\",\"\",'3.01.3'!C45)","v":""},{"$f":"IF('3.01.3'!D45=\"\",\"\",'3.01.3'!D45)","v":""},{"$f":"IF('3.01.3'!E45=\"\",\"\",'3.01.3'!E45)","v":""},{"$f":"IF('3.01.3'!F45=\"\",\"\",'3.01.3'!F45)","v":""},{"$f":"IF('3.01.3'!G45=\"\",\"\",'3.01.3'!G45)","v":""},{"$f":"IF('3.01.3'!H45=\"\",\"\",'3.01.3'!H45)","v":""},{"$f":"IF('3.01.3'!I45=\"\",\"\",'3.01.3'!I45)","v":""},{"$f":"IF('3.01.3'!J45=\"\",\"\",'3.01.3'!J45)","v":""},{"$f":"IF('3.01.3'!K45=\"\",\"\",'3.01.3'!K45)","v":""},{"$f":"IF('3.01.3'!L45=\"\",\"\",'3.01.3'!L45)","v":""},{"$f":"IF('3.01.3'!M45=\"\",\"\",'3.01.3'!M45)","v":""},{"$f":"IF('3.01.3'!N45=\"\",\"\",'3.01.3'!N45)","v":""}]
["3.01.3",0,"",2019,{"$f":"'3.01.3'!A46","v":"30"},{"$f":"IF('3.01.3'!B46=\"\",\"\",'3.01.3'!B46)","v":""},{"$f":"IF('3.01.3'!C46=\"\",\"\",'3.01.3'!C46)","v":""},{"$f":"IF('3.01.3'!D46=\"\",\"\",'3.01.3'!D46)","v":""},{"$f":"IF('3.01.3'!E46=\"\",\"\",'3.01.3'!E46)","v":""},{"$f":"IF('3.01.3'!F46=\"\",\"\",'3.01.3'!F46)","v":""},{"$f":"IF('3.01.3'!G46=\"\",\"\",'3.01.3'!G46)","v":""},{"$f":"IF('3.01.3'!H46=\"\",\"\",'3.01.3'!H46)","v":""},{"$f":"IF('3.01.3'!I46=\"\",\"\",'3.01.3'!I46)","v":""},{"$f":"IF('3.01.3'!J46=\"\",\"\",'3.01.3'!J46)","v":""},{"$f":"IF('3.01.3'!K46=\"\",\"\",'3.01.3'!K46)","v":""},{"$f":"IF('3.01.3'!L46=\"\",\"\",'3.01.3'!L46)","v":""},{"$f":"IF('3.01.3'!M46=\"\",\"\",'3.01.3'!M46)","v":""},{"$f":"IF('3.01.3'!N46=\"\",\"\",'3.01.3'!N46)","v":""}]
["3.01.3",0,"",2019,{"$f":"'3.01.3'!A47","v":"31"},{"$f":"IF('3.01.3'!B47=\"\",\"\",'3.01.3'!B47)","v":""},{"$f":"IF('3.01.3'!C47=\"\",\"\",'3.01.3'!C47)","v":""},{"$f":"IF('3.01.3'!D47=\"\",\"\",'3.01.3'!D47)","v":""},{"$f":"IF('3.01.3'!E47=\"\",\"\",'3.01.3'!E47)","v":""},{"$f":"IF('3.01.3'!F47=\"\",\"\",'3.01.3'!F47)","v":""},{"$f":"IF('3.01.3'!G47=\"\",\"\",'3.01.3'!G47)","v":""},{"$f":"IF('3.01.3'!H47=\"\",\"\",'3.01.3'!H47)","v":""},{"$f":"IF('3.01.3'!I47=\"\",\"\",'3.01.3'!I47)","v":""},{"$f":"IF('3.01.3'!J47=\"\",\"\",'3.01.3'!J47)","v":""},{"$f":"IF('3.01.3'!K47=\"\",\"\",'3.01.3'!K47)","v":""},{"$f":"IF('3.01.3'!L47=\"\",\"\",'3.01.3'!L47)","v":""},{"$f":"IF('3.01.3'!M47=\"\",\"\",'3.01.3'!M47)","v":""},{"$f":"IF('3.01.3'!N47=\"\",\"\",'3.01.3'!N47)","v":""}]
["3.01.3",0,"",2019,{"$f":"'3.01.3'!A48","v":"32"},{"$f":"IF('3.01.3'!B48=\"\",\"\",'3.01.3'!B48)","v":""},{"$f":"IF('3.01.3'!C48=\"\",\"\",'3.01.3'!C48)","v":""},{"$f":"IF('3.01.3'!D48=\"\",\"\",'3.01.3'!D48)","v":""},{"$f":"IF('3.01.3'!E48=\"\",\"\",'3.01.3'!E48)","v":""},{"$f":"IF('3.01.3'!F48=\"\",\"\",'3.01.3'!F48)","v":""},{"$f":"IF('3.01.3'!G48=\"\",\"\",'3.01.3'!G48)","v":""},{"$f":"IF('3.01.3'!H48=\"\",\"\",'3.01.3'!H48)","v":""},{"$f":"IF('3.01.3'!I48=\"\",\"\",'3.01.3'!I48)","v":""},{"$f":"IF('3.01.3'!J48=\"\",\"\",'3.01.3'!J48)","v":""},{"$f":"IF('3.01.3'!K48=\"\",\"\",'3.01.3'!K48)","v":""},{"$f":"IF('3.01.3'!L48=\"\",\"\",'3.01.3'!L48)","v":""},{"$f":"IF('3.01.3'!M48=\"\",\"\",'3.01.3'!M48)","v":""},{"$f":"IF('3.01.3'!N48=\"\",\"\",'3.01.3'!N48)","v":""}]
["3.01.3",0,"",2019,{"$f":"'3.01.3'!A49","v":"33"},{"$f":"IF('3.01.3'!B49=\"\",\"\",'3.01.3'!B49)","v":""},{"$f":"IF('3.01.3'!C49=\"\",\"\",'3.01.3'!C49)","v":""},{"$f":"IF('3.01.3'!D49=\"\",\"\",'3.01.3'!D49)","v":""},{"$f":"IF('3.01.3'!E49=\"\",\"\",'3.01.3'!E49)","v":""},{"$f":"IF('3.01.3'!F49=\"\",\"\",'3.01.3'!F49)","v":""},{"$f":"IF('3.01.3'!G49=\"\",\"\",'3.01.3'!G49)","v":""},{"$f":"IF('3.01.3'!H49=\"\",\"\",'3.01.3'!H49)","v":""},{"$f":"IF('3.01.3'!I49=\"\",\"\",'3.01.3'!I49)","v":""},{"$f":"IF('3.01.3'!J49=\"\",\"\",'3.01.3'!J49)","v":""},{"$f":"IF('3.01.3'!K49=\"\",\"\",'3.01.3'!K49)","v":""},{"$f":"IF('3.01.3'!L49=\"\",\"\",'3.01.3'!L49)","v":""},{"$f":"IF('3.01.3'!M49=\"\",\"\",'3.01.3'!M49)","v":""},{"$f":"IF('3.01.3'!N49=\"\",\"\",'3.01.3'!N49)","v":""}]
["3.01.3",0,"",2019,{"$f":"'3.01.3'!A50","v":"34"},{"$f":"IF('3.01.3'!B50=\"\",\"\",'3.01.3'!B50)","v":""},{"$f":"IF('3.01.3'!C50=\"\",\"\",'3.01.3'!C50)","v":""},{"$f":"IF('3.01.3'!D50=\"\",\"\",'3.01.3'!D50)","v":""},{"$f":"IF('3.01.3'!E50=\"\",\"\",'3.01.3'!E50)","v":""},{"$f":"IF('3.01.3'!F50=\"\",\"\",'3.01.3'!F50)","v":""},{"$f":"IF('3.01.3'!G50=\"\",\"\",'3.01.3'!G50)","v":""},{"$f":"IF('3.01.3'!H50=\"\",\"\",'3.01.3'!H50)","v":""},{"$f":"IF('3.01.3'!I50=\"\",\"\",'3.01.3'!I50)","v":""},{"$f":"IF('3.01.3'!J50=\"\",\"\",'3.01.3'!J50)","v":""},{"$f":"IF('3.01.3'!K50=\"\",\"\",'3.01.3'!K50)","v":""},{"$f":"IF('3.01.3'!L50=\"\",\"\",'3.01.3'!L50)","v":""},{"$f":"IF('3.01.3'!M50=\"\",\"\",'3.01.3'!M50)","v":""},{"$f":"IF('3.01.3'!N50=\"\",\"\",'3.01.3'!N50)","v":""}]
["3.01.3",0,"",2019,{"$f":"'3.01.3'!A51","v":"35"},{"$f":"IF('3.01.3'!B51=\"\",\"\",'3.01.3'!B51)","v":""},{"$f":"IF('3.01.3'!C51=\"\",\"\",'3.01.3'!C51)","v":""},{"$f":"IF('3.01.3'!D51=\"\",\"\",'3.01.3'!D51)","v":""},{"$f":"IF('3.01.3'!E51=\"\",\"\",'3.01.3'!E51)","v":""},{"$f":"IF('3.01.3'!F51=\"\",\"\",'3.01.3'!F51)","v":""},{"$f":"IF('3.01.3'!G51=\"\",\"\",'3.01.3'!G51)","v":""},{"$f":"IF('3.01.3'!H51=\"\",\"\",'3.01.3'!H51)","v":""},{"$f":"IF('3.01.3'!I51=\"\",\"\",'3.01.3'!I51)","v":""},{"$f":"IF('3.01.3'!J51=\"\",\"\",'3.01.3'!J51)","v":""},{"$f":"IF('3.01.3'!K51=\"\",\"\",'3.01.3'!K51)","v":""},{"$f":"IF('3.01.3'!L51=\"\",\"\",'3.01.3'!L51)","v":""},{"$f":"IF('3.01.3'!M51=\"\",\"\",'3.01.3'!M51)","v":""},{"$f":"IF('3.01.3'!N51=\"\",\"\",'3.01.3'!N51)","v":""}]
["3.01.4",0,"",2019,"Type Reviewers Name",{"$f":"IF('3.01.4'!B6=\"\",\"\",'3.01.4'!B6)","v":""}]
["3.01.4",0,"",2019,"Date Last Review Was Complete",{"$f":"IF('3.01.4'!C8=\"\",\"\",'3.01.4'!C8)","v":""}]
["3.01.4",0,"",2019,1,{"$f":"IF('3.01.4'!C13=\"\",\"\",'3.01.4'!C13)","v":""}]
["3.01.4",0,"",2019,2,{"$f":"IF('3.01.4'!C15=\"\",\"\",'3.01.4'!C15)","v":""}]
["3.01.4",0,"",2019,3,{"$f":"IF('3.01.4'!C17=\"\",\"\",'3.01.4'!C17)","v":""}]
["3.01.4",0,"",2019,4,{"$f":"IF('3.01.4'!C19=\"\",\"\",'3.01.4'!C19)","v":""}]
["3.01.4",0,"",2019,5,{"$f":"IF('3.01.4'!C21=\"\",\"\",'3.01.4'!C21)","v":""}]
["3.01.4",0,"",2019,6,{"$f":"IF('3.01.4'!C23=\"\",\"\",'3.01.4'!C23)","v":""}]
["3.01.4",0,"",2019,7,{"$f":"IF('3.01.4'!C25=\"\",\"\",'3.01.4'!C25)","v":""}]
["3.01.4",0,"",2019,8,{"$f":"IF('3.01.4'!C27=\"\",\"\",'3.01.4'!C27)","v":""}]
["3.01.4",0,"",2019,9,{"$f":"IF('3.01.4'!C29=\"\",\"\",'3.01.4'!C29)","v":""}]
["3.01.4",0,"",2019,10,{"$f":"IF('3.01.4'!C31=\"\",\"\",'3.01.4'!C31)","v":""}]
["3.01.4",0,"",2019,11,{"$f":"IF('3.01.4'!C33=\"\",\"\",'3.01.4'!C33)","v":""}]
["3.01.4",0,"",2019,12,{"$f":"IF('3.01.4'!C35=\"\",\"\",'3.01.4'!C35)","v":""}]
["3.01.4",0,"",2019,13,{"$f":"IF('3.01.4'!C37=\"\",\"\",'3.01.4'!C37)","v":""}]
["3.01.4",0,"",2019,14,{"$f":"IF('3.01.4'!C39=\"\",\"\",'3.01.4'!C39)","v":""}]
["3.01.4",0,"",2019,15,{"$f":"IF('3.01.4'!C41=\"\",\"\",'3.01.4'!C41)","v":""}]
["3.01.4",0,"",2019,16,{"$f":"IF('3.01.4'!C43=\"\",\"\",'3.01.4'!C43)","v":""}]
[null,null,null,null,null,{"$f":"IF('3.01.4'!C44=\"\",\"\",'3.01.4'!C44)","v":""}]
[null,null,null,null,null,{"$f":"IF('3.01.4'!C45=\"\",\"\",'3.01.4'!C45)","v":""}]
[]
[]
[]
[]
[]
[]
[]
[]
[]
[]
[]
[]
[]
[]
[]
[]
[null,null,null,null,null,{"$f":"IF('3.01.4'!C47=\"\",\"\",'3.01.4'!C47)","v":""}]
[null,null,null,null,null,{"$f":"IF('3.01.4'!C48=\"\",\"\",'3.01.4'!C48)","v":""}]
[null,null,null,null,null,{"$f":"IF('3.01.4'!C49=\"\",\"\",'3.01.4'!C49)","v":""}]