{"text_format":"1","workbook":"xlsx","n_sheets":9,"sheets":["Revisions","Yearly Data","Instructions","Signature Page","3.01.1","3.01.2","3.01.3","3.01.4","Summary"],"not_rendered":{"charts":0,"images":0,"macros":1,"external_links":0,"defined_names":5,"comments":0,"pivot_tables":0},"unopened":[],"bounds":{"document_bytes":16777216,"sheet_cells":100000,"rows_first":2000,"rows_last":500,"rows_between":2000,"halvings":0,"cell_chars":16384,"cell_head_chars":4096},"cells_cut":0,"cells_raw":0,"read":"whole","date_system":"1900"}

{"sheet":"Revisions","index":0,"n_rows":19,"n_cols":4,"rows_kept":19,"cut":false,"hidden":true,"merged":[]}
[]
["Change","Question","Description"]
[1,"All","Changed the question numbering to simplify",2016]
[2,null,"Updated agency changes",2016]
[3,null,"Added the certification statement to the bottom of the signature page",2016]
[4,null,"Updated instructions",2016]
[5,null,"Updated Signature Page",2016]
[6,null,"Add fair value information to 3.01.3",2016]
[7,null,"Updated Summary tab",2016]
[8,null,"Changed year on Signature Page"]
[9,null,"Changed 3.01.1 to read CASH (PETTY CASH) ON HAND REPORTING FORM"]
[10,null,"Changed form names 3.01.3 and 3.01.4 to 3.01.4 and 3.01.5 respectively.","??"]
[11]
[12]
[13]
[14]
[15]
[16]
[17]

{"sheet":"Yearly Data","index":1,"n_rows":87,"n_cols":3,"rows_kept":87,"cut":false,"hidden":true,"merged":[]}
["Year",2019]
[]
[]
["The following information must be reviewed and updated as necessary anually:"]
[]
["AGCY  CODE","AGENCY NAME","FY Added"]
["A010","LEGISLATIVE DEPARTMENT - THE SENATE"]
["A050","LEGISLATIVE DEPARTMENT - HOUSE OF REPRESENTATIVES"]
["A150","LEGISLATIVE DEPARTMENT - CODIFICATION OF LAWS & LEGISLATIVE COUNCIL"]
["A170","LEGISLATIVE DEPARTMENT - LEGISLATIVE SERVICES AGENCY"]
["A200","LEGISLATIVE DEPARTMENT - LEGISLATIVE AUDIT COUNCIL"]
["A850","EDUCATION OVERSIGHT COMMITTEE"]
["B040","JUDICIAL DEPARTMENT"]
["C050","ADMINISTRATIVE LAW JUDGES"]
["D050","GOVERNOR'S OFFICE--EXECUTIVE CONTROL OF STATE"]
["D100","GOVERNOR'S OFFICE--STATE LAW ENFORCEMENT DIVISION"]
["D170","GOVERNOR'S OFFICE-- EXECUTIVE POLICY & PROGRAMS"]
["D200","GOVERNOR'S OFFICE--MANSION & GROUNDS"]
["D250","INSPECTOR GENERAL"]
["D500","DEPARTMENT OF ADMINSTRATION"]
["E040","LIEUTENANT GOVERNOR'S OFFICE"]
["E080","SECRETARY OF STATE'S OFFICE"]
["E120","COMPTROLLER GENERAL'S OFFICE\n"]
["E160","STATE TREASURER'S OFFICE                                                                       "]
["E190","RETIREMENT SYSTEM  INVESTMENT COMMISSION"]
["E200","ATTORNEY GENERAL'S OFFICE"]
["E210","PROSECUTION COORDINATION  COMMISSION"]
["E230","COMMISSION ON INDIGENT DEFENSE "]
["E240","ADJUTANT GENERAL'S OFFICE"]
["E280","ELECTION COMMISSION"]
{"$rows_left_out":58}
{"sheet":"Instructions","index":2,"n_rows":75,"n_cols":10,"rows_kept":75,"cut":false,"hidden":false,"merged":[]}
["STATE OF SOUTH CAROLINA"]
["YEAR-END REPORTING PROCEDURES MANUAL"]
["SECTION 3.01, CASH AND INVESTMENTS REPORTING PACKAGE"]
[]
[null,"PURPOSE and OBJECTIVE:"]
[null,"The amount of cash and investments reported in the financial statements of the State is an important "]
[null,"measure of the State's financial soundness.  This reporting package is designed to gather"]
[null,"information regarding the types of cash and investments owned by the agencies essential for "]
[null,"accurate and complete reporting."]
[]
[null,"Please refer to the Reporting Procedure Manual for concepts and definitions related to this section"]
[null,"of the reporting forms."]
[]
[null,"If there is a question about whether a balance under the agency's management should be included, "]
[null,"call the Statewide Financial Reporting Division of the Comptroller General's Office for guidance.  "]
[null,"It is important that all of the agency's assets be included in the Statewide CAFR."]
[]
[null,"INSTRUCTIONS FOR THE COMPLETION OF THE FORMS"]
[]
[null,"Select your agency from the drop down box on tab Signature Page.  The selection will populate the agency code "]
[null,"and name to the appropriate places throughout the workbook."]
[null,"Complete each section based on the results from the Master Reporting Package. Upon completion"]
[null,"and review of the required sections of this package, save the excel file for your records, send an Excel"]
[null,"copy of the file to CAFR@cg.sc.gov.  Any required documentation required based on the completion"]
[null,"of this package should be scanned and e-mailed to the above address as well."]
[null,"Signature Page"]
[null,"Please type the name of the preparer and reviewer, their titles, e-mail address', phone numbers and date "]
[null,"completed in the section below the agency code and agency name.  If there are more than one preparer"]
[null,"or reviewer, include each additional preparer or reviewer on the same line."]
[null,"Cash on Hand Reporting Form",null,null,null,null,null,null,null,"3.01.1"]
{"$rows_left_out":46}
{"sheet":"Signature Page","index":3,"n_rows":46,"n_cols":6,"rows_kept":46,"cut":false,"hidden":false,"merged":[[45,1,45,5],[31,3,31,4],[37,1,37,5],[39,1,39,5],[41,1,41,5],[43,1,43,5]]}
[null,null,"CASH AND INVESTMENTS REPORTING PACKAGE SIGNATURE PAGE"]
[]
[]
[null,null,"CAFR Reporting Period:",null,{"$f":"Year","v":2019}]
[null,null,"Agency Number:",null,null,"*"]
[null,null,"Agency Name",null,{"$f":"IF(ISERROR(VLOOKUP(AgencyCode,'Yearly Data'!A7:B87,2,FALSE))=TRUE,\"\",VLOOKUP(AgencyCode,'Yearly Data'!A7:B87,2,FALSE))","v":""}]
[]
[]
[]
[null,null,null,null,"Before completing this package, please answer the following questions."]
[null,null,null,null,"Is form 3.01.1 required based on the Master Reporting Package?"]
[null,null,null,null,"Is form 3.01.2 required based on the Master Reporting Package?"]
[null,null,null,null,"Is form 3.01.3 required based on the Master Reporting Package?"]
[]
[null,null,"Preparer","Date:",null,"*"]
[null,null,null,"Name:",null,"*"]
[null,null,null,"Title:",null,"*"]
[null,null,null,"e-mail:",null,"*"]
[null,null,null,"Phone Number:",null,"*"]
[null,null,null,"Signature:",null,"*"]
[]
[null,null,{"$f":"IF('3.01.4'!C46=TRUE,\"The review of the closing package is incomplete.\",\"\")","v":"The review of the closing package is incomplete."}]
[null,null,"Reviewer","Date:",null,"*"]
[null,null,null,"Name:",null,"*"]
[null,null,null,"Title:",null,"*"]
[null,null,null,"e-mail:",null,"*"]
[null,null,null,"Phone Number:",null,"*"]
[null,null,null,"Signature:",null,"*"]
[]
[null,null,"Signatures are an assertion of the accuracy and completeness of the information reported.  "]
{"$rows_left_out":17}
{"sheet":"3.01.1","index":4,"n_rows":183,"n_cols":5,"rows_kept":183,"cut":false,"hidden":false,"merged":[[0,0,0,4],[1,0,1,4],[2,0,2,4],[59,0,61,2],[23,1,23,3],[19,1,19,3],[9,1,9,3],[17,1,17,3],[21,1,21,3],[5,2,5,4],[6,2,6,4],[11,1,15,3]]}
["STATE OF SOUTH CAROLINA"]
["CASH ON HAND/PETTY CASH REPORTING FORM"]
[{"$f":"IF(Year=\"\",\"At June 30, \",\"At June 30, \"&Year)","v":"At June 30, 2019"}]
[]
[]
["Agency:",{"$f":"IF(AgencyCode=\"\",\"\",AgencyCode)","v":""},{"$f":"IF(AgencyName=\"\",\"Please choose your agency number on the Signature Page form.\",AgencyName)","v":"Please choose your agency number on the Signature Page form."}]
[null,"Business Area","Name"]
[]
[]
["1.","Was any portion of your authorized cash on hand/petty cash relinquished or surrendered during the year?"]
[]
[null,{"$f":"IF(E10=\"Yes\",\"Attach a memo to this package describing the reasons for the elimination.  Include documentation of the transaction utilized to record the decrease in this cash general ledger account and increase in the other.\",\"\")","v":""}]
[]
[]
[]
[]
[]
["2.","Provide the date that the cash on hand was last counted and/or replenished?"]
[]
[null,{"$f":"IF(B6=\"\",\"\",IF(E18=\"\",\"If you agency has petty cash, please enter a date.\",IF(E18<VALUE(\"6/1/\"&Year),\"Attach explanation for lack of timely oversight.\",\"\")))","v":""}]
[]
["3.","Does the report provided by the Comptroller General's Office properly reflect the balance for your cash on hand/ petty cash?"]
[]
[null,{"$f":"IF(B6=\"\",\"\",IF(E22=\"\",\"Please answer question 3.\",IF(E22=\"No\",\"Please identify the incorrect balance (by accounting fund) and provide the additional information requested below:\",\"\")))","v":""}]
[]
["Account #","Fund","Explanation of the difference identified:","Reconciled Balance","Last date counted"]
["01"]
["02"]
["03"]
["04"]
{"$rows_left_out":154}
{"sheet":"3.01.2","index":5,"n_rows":102,"n_cols":10,"rows_kept":102,"cut":false,"hidden":false,"merged":[[7,1,7,6],[5,3,5,8],[82,1,84,5],[0,0,0,10],[1,0,1,10],[2,0,2,10]]}
["STATE OF SOUTH CAROLINA"]
["DEPOSITS WITH BANKS REPORTING FORM"]
[{"$f":"IF(Year=\"\",\"At June 30, \",\"At June 30, \"&Year)","v":"At June 30, 2019"}]
[]
[]
["Agency:",null,{"$f":"IF(AgencyCode=\"\",\"\",AgencyCode)","v":""},{"$f":"IF(AgencyName=\"\",\"Please choose your agency number on the Signature Page form.\",AgencyName)","v":"Please choose your agency number on the Signature Page form."}]
[null,null,"Business Area","Agency Name"]
[]
[null,"Complete the following information for each bank account owned by the agency.  Include composite accounts owned by the agency."]
["Bank Account #","In SCEIS?","SCEIS GL No","Fund","Recorded Balance","Reconciled Balance","Bank Statement Balance","Eval","Bank Name","Bank Acct No"]
[]
["01",null,null,null,null,null,null,{"$f":"IF(B12=\"\",\"\",IF(B12=\"No\",\"A\",IF(E12<>F12,\"B\",IF(D12=\"\",\"C\",\"D\"))))","v":""}]
["02",null,null,null,null,null,null,{"$f":"IF(B13=\"\",\"\",IF(B13=\"No\",\"A\",IF(E13<>F13,\"B\",IF(OR(D13=\"\",ISERROR(VALUE(LEFT(D13,1))),VALUE(LEFT(D13,1))>6),\"C\",\"D\"))))","v":""}]
["03",null,null,null,null,null,null,""]
["04",null,null,null,null,null,null,""]
["05",null,null,null,null,null,null,""]
["06",null,null,null,null,null,null,""]
["07",null,null,null,null,null,null,""]
["08",null,null,null,null,null,null,""]
["09",null,null,null,null,null,null,""]
["10",null,null,null,null,null,null,""]
["11",null,null,null,null,null,null,""]
["12",null,null,null,null,null,null,""]
["13",null,null,null,null,null,null,""]
["14",null,null,null,null,null,null,""]
["15",null,null,null,null,null,null,""]
["16",null,null,null,null,null,null,""]
["17",null,null,null,null,null,null,""]
["18",null,null,null,null,null,null,""]
["19",null,null,null,null,null,null,""]
{"$rows_left_out":73}
{"sheet":"3.01.3","index":6,"n_rows":65,"n_cols":14,"rows_kept":65,"cut":false,"hidden":false,"merged":[[9,7,11,9],[5,2,5,7],[0,0,0,14],[1,0,1,14],[2,0,2,14]]}
["STATE OF SOUTH CAROLINA"]
["INVESTMENTS IN MARKETABLE SECURITIES REPORTING FORM"]
[{"$f":"IF(Year=\"\",\"At June 30, \",\"At June 30, \"&Year)","v":"At June 30, 2019"}]
[]
[]
["Agency:",{"$f":"IF(AgencyCode=\"\",\"\",AgencyCode)","v":""},{"$f":"IF(AgencyName=\"\",\"Please choose your agency number on the Signature Page form.\",AgencyName)","v":"Please choose your agency number on the Signature Page form."}]
[null,"Business Area","Name"]
[]
[]
[null,"Does the report provided by the Comptroller General's Office properly ",null,null,null,null,null,{"$f":"IF(G11=\"\",\"\",IF(G11=\"No\",\"Provide below appropriate offset for recording difference.\",\"\"))","v":""}]
[null,"reflect the balance(s) for investments owned (at fair value)?"]
[]
[]
[null,"Please provide the following, if additional space is required, an attachment may be submitted in lieu (please indicate See Attached in the Asset Name field)."]
[]
["Investment Number","CUSIP/Ticker","Asset Name"," Type of Security","Credit Rating","Is the fair value of the asset determined by market quotations?","SCEIS GL No","Fund","Program Name or Use of Assets","Recorded Value","Eval","Fair value 6/30","How was fair value determination made","Review Notes"]
["01",null,null,null,null,null,null,null,null,null,{"$f":"IF(L17=\"\",\"\",IF(H17=\"\",\"A\",IF(G17=\"\",\"B\",IF(L17<>J17,\"C\",\"D\"))))","v":""},null,null,{"$f":"IF(AND(D17=\"\",F17=\"\",G17=\"\",H17=\"\",J17=\"\",L17=\"\",M17=\"\")=TRUE,\"\",IF(OR(D17=\"\",F17=\"\",G17=\"\",H17=\"\",J17=\"\",L17=\"\",M17=\"\")=TRUE,\"Please complete remaining sections.\",\"\"))","v":""}]
["02",null,null,null,null,null,null,null,null,null,{"$f":"IF(L18=\"\",\"\",IF(H18=\"\",\"A\",IF(G18=\"\",\"B\",IF(L18<>J18,\"C\",\"D\"))))","v":""},null,null,{"$f":"IF(AND(D18=\"\",F18=\"\",G18=\"\",H18=\"\",J18=\"\",L18=\"\",M18=\"\")=TRUE,\"\",IF(OR(D18=\"\",F18=\"\",G18=\"\",H18=\"\",J18=\"\",L18=\"\",M18=\"\")=TRUE,\"Please complete remaining sections.\",\"\"))","v":""}]
["03",null,null,null,null,null,null,null,null,null,{"$f":"IF(L19=\"\",\"\",IF(H19=\"\",\"A\",IF(G19=\"\",\"B\",IF(L19<>J19,\"C\",\"D\"))))","v":""},null,null,""]
["04",null,null,null,null,null,null,null,null,null,{"$f":"IF(L20=\"\",\"\",IF(H20=\"\",\"A\",IF(OR(G20=\"\",ISERROR(VALUE(LEFT(G20,1))),VALUE(LEFT(G20,1))>1),\"B\",IF(L20<>J20,\"C\",\"D\"))))","v":""},null,null,""]
["05",null,null,null,null,null,null,null,null,null,"",null,null,""]
["06",null,null,null,null,null,null,null,null,null,"",null,null,""]
["07",null,null,null,null,null,null,null,null,null,"",null,null,""]
["08",null,null,null,null,null,null,null,null,null,"",null,null,""]
["09",null,null,null,null,null,null,null,null,null,"",null,null,""]
["10",null,null,null,null,null,null,null,null,null,"",null,null,""]
["11",null,null,null,null,null,null,null,null,null,"",null,null,""]
["12",null,null,null,null,null,null,null,null,null,"",null,null,""]
["13",null,null,null,null,null,null,null,null,null,"",null,null,""]
["14",null,null,null,null,null,null,null,null,null,"",null,null,""]
{"$rows_left_out":36}
{"sheet":"3.01.4","index":7,"n_rows":46,"n_cols":3,"rows_kept":46,"cut":false,"hidden":false,"merged":[[3,0,3,3]]}
["STATE OF SOUTH CAROLINA"]
["CASH AND INVESTMENTS REPORTING PACKAGE"]
["REVIEWER CHECKLIST"]
[{"$f":"IF(Year=\"\",\"\",\"FISCAL YEAR \"&Year)","v":"FISCAL YEAR 2019"}]
[]
["Reviewed by:"]
[null,"Type Reviewer's Name"]
[null,"Date Last Review Step Was Completed:   "]
[]
["Instructions","Type the name of the person reviewing this closing package and the date of the review.  The reviewer should also answer each of the sixteen questions below.  All questions must be answered either \"Yes\", \"No\", or \"N/A\" for non applicable.  If a question is left blank the closing package will be rejected and returned."]
[]
[]
[{"$f":"COUNT(A$9:A9)+1","v":1},"Is the reviewer of the form someone other than the person who prepared it?"]
[]
[{"$f":"COUNT(A$9:A13)+1","v":2},"Does the signature page form contain the typed name of each preparer and reviewer?"]
[]
[3,"If the agency is live in SCEIS, have appropriate entries been made in SCEIS to agree the amounts reported to the agency's general ledger?"]
[]
[4,"Are the responses to the \"Does this part apply to this agency?\" appropriate and accurate?"]
[]
[5,"Has the agency refrained from completing sections that do not apply to it?"]
[]
[6,"Is supporting documentation retained by the agency for the amounts confirmed and reported?"]
[]
[7,"Are all cash on hand (petty cash, change funds, and other) accounts reported for your agency?"]
[]
[8,"Is the authorized balance (for cash on hand or petty cash) reported accurate?"]
[]
[9,"Are all bank accounts including composite reservior bank accounts applicable to your agency reported?"]
[]
{"$rows_left_out":17}
{"sheet":"Summary","index":8,"n_rows":185,"n_cols":18,"rows_kept":185,"cut":false,"hidden":true,"merged":[]}
["Worksheet","Agnecy Code","Agency Name","Year","QUESTION",1,2,3,4,5,6,7,8,9,10,11,12]
["3.01.1",{"$f":"AgencyCode","v":0},{"$f":"AgencyName","v":""},{"$f":"Year","v":2019},{"$f":"'3.01.1'!A10","v":"1."},{"$f":"IF('3.01.1'!E10=\"\",\"\",'3.01.1'!E10)","v":""}]
["3.01.1",0,{"$f":"AgencyName","v":""},2019,"1.a",{"$f":"IF('3.01.1'!B12=\"\",\"\",'3.01.1'!B12)","v":""}]
["3.01.1",0,"",2019,{"$f":"'3.01.1'!A18","v":"2."},{"$f":"IF('3.01.1'!E18=\"\",\"\",'3.01.1'!E18)","v":""}]
["3.01.1",0,"",2019,"2.a",{"$f":"IF('3.01.1'!B20=\"\",\"\",'3.01.1'!B20)","v":""}]
["3.01.1",0,"",2019,{"$f":"'3.01.1'!A22","v":"3."},{"$f":"IF('3.01.1'!E22=\"\",\"\",'3.01.1'!E22)","v":""}]
["3.01.1",0,"",2019,"3.a",{"$f":"IF('3.01.1'!B24=\"\",\"\",'3.01.1'!B24)","v":""},{"$f":"IF('3.01.1'!D25=\"\",\"\",'3.01.1'!D25)","v":""},{"$f":"IF('3.01.1'!F25=\"\",\"\",'3.01.1'!F25)","v":""},{"$f":"IF('3.01.1'!H25=\"\",\"\",'3.01.1'!H25)","v":""}]
["3.01.1",0,"",2019,{"$f":"'3.01.1'!A27","v":"01"},{"$f":"IF('3.01.1'!B27=\"\",\"\",'3.01.1'!B27)","v":""},{"$f":"IF('3.01.1'!C27=\"\",\"\",'3.01.1'!C27)","v":""},{"$f":"IF('3.01.1'!D27=\"\",\"\",'3.01.1'!D27)","v":""},{"$f":"IF('3.01.1'!E27=\"\",\"\",'3.01.1'!E27)","v":""}]
["3.01.1",0,"",2019,{"$f":"'3.01.1'!A28","v":"02"},{"$f":"IF('3.01.1'!B28=\"\",\"\",'3.01.1'!B28)","v":""},{"$f":"IF('3.01.1'!C28=\"\",\"\",'3.01.1'!C28)","v":""},{"$f":"IF('3.01.1'!D28=\"\",\"\",'3.01.1'!D28)","v":""},{"$f":"IF('3.01.1'!E28=\"\",\"\",'3.01.1'!E28)","v":""}]
["3.01.1",0,"",2019,{"$f":"'3.01.1'!A29","v":"03"},{"$f":"IF('3.01.1'!B29=\"\",\"\",'3.01.1'!B29)","v":""},{"$f":"IF('3.01.1'!C29=\"\",\"\",'3.01.1'!C29)","v":""},{"$f":"IF('3.01.1'!D29=\"\",\"\",'3.01.1'!D29)","v":""},{"$f":"IF('3.01.1'!E29=\"\",\"\",'3.01.1'!E29)","v":""}]
["3.01.1",0,"",2019,{"$f":"'3.01.1'!A30","v":"04"},{"$f":"IF('3.01.1'!B30=\"\",\"\",'3.01.1'!B30)","v":""},{"$f":"IF('3.01.1'!C30=\"\",\"\",'3.01.1'!C30)","v":""},{"$f":"IF('3.01.1'!D30=\"\",\"\",'3.01.1'!D30)","v":""},{"$f":"IF('3.01.1'!E30=\"\",\"\",'3.01.1'!E30)","v":""}]
["3.01.1",0,"",2019,{"$f":"'3.01.1'!A31","v":"05"},{"$f":"IF('3.01.1'!B31=\"\",\"\",'3.01.1'!B31)","v":""},{"$f":"IF('3.01.1'!C31=\"\",\"\",'3.01.1'!C31)","v":""},{"$f":"IF('3.01.1'!D31=\"\",\"\",'3.01.1'!D31)","v":""},{"$f":"IF('3.01.1'!E31=\"\",\"\",'3.01.1'!E31)","v":""}]
["3.01.1",0,"",2019,{"$f":"'3.01.1'!A32","v":"06"},{"$f":"IF('3.01.1'!B32=\"\",\"\",'3.01.1'!B32)","v":""},{"$f":"IF('3.01.1'!C32=\"\",\"\",'3.01.1'!C32)","v":""},{"$f":"IF('3.01.1'!D32=\"\",\"\",'3.01.1'!D32)","v":""},{"$f":"IF('3.01.1'!E32=\"\",\"\",'3.01.1'!E32)","v":""}]
["3.01.1",0,"",2019,{"$f":"'3.01.1'!A33","v":"07"},{"$f":"IF('3.01.1'!B33=\"\",\"\",'3.01.1'!B33)","v":""},{"$f":"IF('3.01.1'!C33=\"\",\"\",'3.01.1'!C33)","v":""},{"$f":"IF('3.01.1'!D33=\"\",\"\",'3.01.1'!D33)","v":""},{"$f":"IF('3.01.1'!E33=\"\",\"\",'3.01.1'!E33)","v":""}]
["3.01.1",0,"",2019,{"$f":"'3.01.1'!A34","v":"08"},{"$f":"IF('3.01.1'!B34=\"\",\"\",'3.01.1'!B34)","v":""},{"$f":"IF('3.01.1'!C34=\"\",\"\",'3.01.1'!C34)","v":""},{"$f":"IF('3.01.1'!D34=\"\",\"\",'3.01.1'!D34)","v":""},{"$f":"IF('3.01.1'!E34=\"\",\"\",'3.01.1'!E34)","v":""}]
["3.01.1",0,"",2019,{"$f":"'3.01.1'!A35","v":"09"},{"$f":"IF('3.01.1'!B35=\"\",\"\",'3.01.1'!B35)","v":""},{"$f":"IF('3.01.1'!C35=\"\",\"\",'3.01.1'!C35)","v":""},{"$f":"IF('3.01.1'!D35=\"\",\"\",'3.01.1'!D35)","v":""},{"$f":"IF('3.01.1'!E35=\"\",\"\",'3.01.1'!E35)","v":""}]
["3.01.1",0,"",2019,{"$f":"'3.01.1'!A36","v":"10"},{"$f":"IF('3.01.1'!B36=\"\",\"\",'3.01.1'!B36)","v":""},{"$f":"IF('3.01.1'!C36=\"\",\"\",'3.01.1'!C36)","v":""},{"$f":"IF('3.01.1'!D36=\"\",\"\",'3.01.1'!D36)","v":""},{"$f":"IF('3.01.1'!E36=\"\",\"\",'3.01.1'!E36)","v":""}]
["3.01.1",0,"",2019,{"$f":"'3.01.1'!A37","v":"11"},{"$f":"IF('3.01.1'!B37=\"\",\"\",'3.01.1'!B37)","v":""},{"$f":"IF('3.01.1'!C37=\"\",\"\",'3.01.1'!C37)","v":""},{"$f":"IF('3.01.1'!D37=\"\",\"\",'3.01.1'!D37)","v":""},{"$f":"IF('3.01.1'!E37=\"\",\"\",'3.01.1'!E37)","v":""}]
["3.01.1",0,"",2019,{"$f":"'3.01.1'!A38","v":"12"},{"$f":"IF('3.01.1'!B38=\"\",\"\",'3.01.1'!B38)","v":""},{"$f":"IF('3.01.1'!C38=\"\",\"\",'3.01.1'!C38)","v":""},{"$f":"IF('3.01.1'!D38=\"\",\"\",'3.01.1'!D38)","v":""},{"$f":"IF('3.01.1'!E38=\"\",\"\",'3.01.1'!E38)","v":""}]
["3.01.1",0,"",2019,{"$f":"'3.01.1'!A39","v":"13"},{"$f":"IF('3.01.1'!B39=\"\",\"\",'3.01.1'!B39)","v":""},{"$f":"IF('3.01.1'!C39=\"\",\"\",'3.01.1'!C39)","v":""},{"$f":"IF('3.01.1'!D39=\"\",\"\",'3.01.1'!D39)","v":""},{"$f":"IF('3.01.1'!E39=\"\",\"\",'3.01.1'!E39)","v":""}]
["3.01.1",0,"",2019,{"$f":"'3.01.1'!A40","v":"14"},{"$f":"IF('3.01.1'!B40=\"\",\"\",'3.01.1'!B40)","v":""},{"$f":"IF('3.01.1'!C40=\"\",\"\",'3.01.1'!C40)","v":""},{"$f":"IF('3.01.1'!D40=\"\",\"\",'3.01.1'!D40)","v":""},{"$f":"IF('3.01.1'!E40=\"\",\"\",'3.01.1'!E40)","v":""}]
["3.01.1",0,"",2019,{"$f":"'3.01.1'!A41","v":"15"},{"$f":"IF('3.01.1'!B41=\"\",\"\",'3.01.1'!B41)","v":""},{"$f":"IF('3.01.1'!C41=\"\",\"\",'3.01.1'!C41)","v":""},{"$f":"IF('3.01.1'!D41=\"\",\"\",'3.01.1'!D41)","v":""},{"$f":"IF('3.01.1'!E41=\"\",\"\",'3.01.1'!E41)","v":""}]
["3.01.1",0,"",2019,{"$f":"'3.01.1'!A42","v":"16"},{"$f":"IF('3.01.1'!B42=\"\",\"\",'3.01.1'!B42)","v":""},{"$f":"IF('3.01.1'!C42=\"\",\"\",'3.01.1'!C42)","v":""},{"$f":"IF('3.01.1'!D42=\"\",\"\",'3.01.1'!D42)","v":""},{"$f":"IF('3.01.1'!E42=\"\",\"\",'3.01.1'!E42)","v":""}]
["3.01.1",0,"",2019,{"$f":"'3.01.1'!A43","v":"17"},{"$f":"IF('3.01.1'!B43=\"\",\"\",'3.01.1'!B43)","v":""},{"$f":"IF('3.01.1'!C43=\"\",\"\",'3.01.1'!C43)","v":""},{"$f":"IF('3.01.1'!D43=\"\",\"\",'3.01.1'!D43)","v":""},{"$f":"IF('3.01.1'!E43=\"\",\"\",'3.01.1'!E43)","v":""}]
["3.01.1",0,"",2019,{"$f":"'3.01.1'!A44","v":"18"},{"$f":"IF('3.01.1'!B44=\"\",\"\",'3.01.1'!B44)","v":""},{"$f":"IF('3.01.1'!C44=\"\",\"\",'3.01.1'!C44)","v":""},{"$f":"IF('3.01.1'!D44=\"\",\"\",'3.01.1'!D44)","v":""},{"$f":"IF('3.01.1'!E44=\"\",\"\",'3.01.1'!E44)","v":""}]
["3.01.1",0,"",2019,{"$f":"'3.01.1'!A45","v":"19"},{"$f":"IF('3.01.1'!B45=\"\",\"\",'3.01.1'!B45)","v":""},{"$f":"IF('3.01.1'!C45=\"\",\"\",'3.01.1'!C45)","v":""},{"$f":"IF('3.01.1'!D45=\"\",\"\",'3.01.1'!D45)","v":""},{"$f":"IF('3.01.1'!E45=\"\",\"\",'3.01.1'!E45)","v":""}]
["3.01.1",0,"",2019,{"$f":"'3.01.1'!A46","v":"20"},{"$f":"IF('3.01.1'!B46=\"\",\"\",'3.01.1'!B46)","v":""},{"$f":"IF('3.01.1'!C46=\"\",\"\",'3.01.1'!C46)","v":""},{"$f":"IF('3.01.1'!D46=\"\",\"\",'3.01.1'!D46)","v":""},{"$f":"IF('3.01.1'!E46=\"\",\"\",'3.01.1'!E46)","v":""}]
["3.01.1",0,"",2019,{"$f":"'3.01.1'!A47","v":"21"},{"$f":"IF('3.01.1'!B47=\"\",\"\",'3.01.1'!B47)","v":""},{"$f":"IF('3.01.1'!C47=\"\",\"\",'3.01.1'!C47)","v":""},{"$f":"IF('3.01.1'!D47=\"\",\"\",'3.01.1'!D47)","v":""},{"$f":"IF('3.01.1'!E47=\"\",\"\",'3.01.1'!E47)","v":""}]
["3.01.1",0,"",2019,{"$f":"'3.01.1'!A48","v":"22"},{"$f":"IF('3.01.1'!B48=\"\",\"\",'3.01.1'!B48)","v":""},{"$f":"IF('3.01.1'!C48=\"\",\"\",'3.01.1'!C48)","v":""},{"$f":"IF('3.01.1'!D48=\"\",\"\",'3.01.1'!D48)","v":""},{"$f":"IF('3.01.1'!E48=\"\",\"\",'3.01.1'!E48)","v":""}]
["3.01.1",0,"",2019,{"$f":"'3.01.1'!A49","v":"23"},{"$f":"IF('3.01.1'!B49=\"\",\"\",'3.01.1'!B49)","v":""},{"$f":"IF('3.01.1'!C49=\"\",\"\",'3.01.1'!C49)","v":""},{"$f":"IF('3.01.1'!D49=\"\",\"\",'3.01.1'!D49)","v":""},{"$f":"IF('3.01.1'!E49=\"\",\"\",'3.01.1'!E49)","v":""}]
{"$rows_left_out":155}