{"text_format":"1","workbook":"xlsx","n_sheets":5,"sheets":["Instructions","Signature Page ","2.1.1","AP Worksheet ","AP Worksheet"],"not_rendered":{"charts":0,"images":0,"macros":1,"external_links":0,"defined_names":6,"comments":0,"pivot_tables":0},"unopened":[],"bounds":{"document_bytes":16777216,"sheet_cells":100000,"rows_first":2000,"rows_last":500,"rows_between":2000,"halvings":0,"cell_chars":16384,"cell_head_chars":4096},"cells_cut":0,"cells_raw":0,"read":"whole","date_system":"1900"}

{"sheet":"Instructions","index":0,"n_rows":51,"n_cols":10,"rows_kept":51,"cut":false,"hidden":false,"merged":[[47,1,47,11]]}
["SUBSEQUENT EVENTS REPORTING PACKAGE CHECKLIST"]
["INSTRUCTIONS FOR COMPLETION"]
["Form 2.1.1"]
[]
[null,"PURPOSE AND OBJECTIVES"]
[null,"The purpose of this year-end reporting package is to identify for each agency the information necessary to "]
[null,"inform the Comptroller General's Office of events or information obtained subsequent to submission of the "]
[null,"Master Reporting Package Checklist and the other Year-end Reporting Packages which impacts the "]
[null,"accuracy of the information provided.  The evaluation of accuracy must take into account the completeness "]
[null,"of the previously reported information based on knowledge as of the completion of this reporting package."]
[]
[null,"The Agencies Submitting Financial Statements Year-end Reporting Policies and Procedures Manual "]
[null,"provides guidance with regard to GAAP, policies and procedures, and key terms that may assist agency "]
[null,"personnel in responding accurately to the questions included.  Please utilize this resource in conjunction"]
[null,"with the completion of this form."]
[]
[null,"Information included in this package should only impact the Fiscal Year for which the reporting package is "]
[null,"being completed.  It should not include information on transactions funded, inititated, and recorded for the "]
[null,"next reporting fiscal year."]
[]
[null,"If additional questions arise during the completion, please request guidance from the Comptroller "]
[null,"General's Office Financial Reporting Unit."]
[]
[null,"Signature Page"]
[null,"This form should be completed, printed, signed and a PDF copy of the signed sheet sent via e-mail to the "]
[null,"Comptroller General's office.  The user should choose their agency, then type in the preparer's and "]
[null,"reviewers name, title, date prepared/reviewed, e-mail contact and phone number."]
[]
[null,"INSTRUCTIONS FOR COMPLETING THE FORM",null,null,null,null,null,null,null,"2.1.1"]
[null,"This form should be completed after the submission of all other Year-end Reporting Packages."]
[null,"The checklist walks the users through the thought process for identifying errors and omissions in the"]
[null,"agency's summarized financial records (accounting system trial balance) and identifies the areas for which "]
[null,"additional analysis and reporting is required for subsequent events.  It provides guidance on the methods "]
[null,"of communication required for reporting these subsequent events to the Comptroller General's Office.  "]
[null,"● Respond to each question based on knowledge of the agency's activities, operations, and analysis "]
[null,"of transactions."]
[null,"● Follow the instructions for responding to the questions asked and moving through the checklist."]
[null,"● Enter the information requested by the descriptions of each field."]
[null,"○   Features within the form to assist in completion:"]
[null,"►    A drop-down menu is provided to select the reporting year."]
[null,"►    Drop-down menus are included for the Yes or No responses.  "]
[null,"Upon completion of the information requested:"]
[null,"● The individual completing the form should review the form for accuracy and completeness."]
[null,"● The Finance Director or Executive Director must review the Form indicating agreement with"]
[null,"the information’s accuracy and completeness before sending it to the Comptroller General's Office."]
[null,"● Both the preparer and approver certify that the information provided on this reporting package"]
[null,"is complete and accurate to the best of their knowledge."]
[null,"● Send the completed Checklist to the Comptroller General's Office NO EARLIER THAN October 7 and no later than October 22."]
[null,"● The completed checklist should be retained by the agency as part of its year-end working papers.  The "]
[null,"Comptroller General's Office will telephone the individual completing the checklist if there are any "]
[null,"questions.  The responses to the checklist determines what additional action is required."]

{"sheet":"Signature Page ","index":1,"n_rows":125,"n_cols":6,"rows_kept":125,"cut":false,"hidden":false,"merged":[[124,1,124,5],[25,3,25,4],[112,0,112,5],[116,1,116,5],[118,1,118,5],[120,1,120,5],[122,1,122,5]]}
[null,null,"Subsequent events - Signature Sheet"]
[]
[]
[null,null,"CAFR Reporting Period:",null,2019]
[null,null,"Agency Number:",null,null,{"$f":"IF(AgencyCode=\"\",\"*\",\"\")","v":"*"}]
[null,null,"Agency Name",null,{"$f":"IF(ISERROR(VLOOKUP(E5,C31:D110,2,FALSE))=TRUE,\"\",VLOOKUP(E5,C31:D110,2,FALSE))","v":""}]
[]
[]
[]
[null,null,"Preparer","Date:",null,{"$f":"IF(E10=\"\",\"*\",\"\")","v":"*"}]
[null,null,null,"Name:",null,{"$f":"IF(E11=\"\",\"*\",\"\")","v":"*"}]
[null,null,null,"Title:",null,"*"]
[null,null,null,"e-mail:",null,"*"]
[null,null,null,"Phone Number:",null,"*"]
[null,null,null,"Signature:",null,"*"]
[]
[null,null,"Reviewer","Date:",null,{"$f":"IF(E17=\"\",\"*\",\"\")","v":"*"}]
[null,null,null,"Name:",null,"*"]
[null,null,null,"Title:",null,"*"]
[null,null,null,"e-mail:",null,"*"]
[null,null,null,"Phone Number:",null,"*"]
[null,null,null,"Signature:",null,"*"]
[]
[null,null,"Signatures are an assertion of the accuracy and completeness of the information reported.  "]
[]
[null,null,"*",{"$f":"IF(OR(F5=\"*\",F10=\"*\",F11=\"*\",F12=\"*\",F13=\"*\",F14=\"*\",F17=\"*\",F18=\"*\",F19=\"*\",F20=\"*\",F21=\"*\")=TRUE,\"Please complete the above page where indicated by a red star.\",\"Please print a copy of this signature page, have the preparer and reviewer sign, scan a copy of the signed Signature Page and e-mail it to CAFR@CG.SC.GOV.\")","v":"Please complete the above page where indicated by a red star."}]
[]
[null,null,"The following information must be reviewed and updated as necessary anually:"]
[]
[null,null,"AGCY  CODE","AGENCY NAME","Year"]
[null,null,"A010","LEGISLATIVE DEPARTMENT - THE SENATE"]
[null,null,"A050","LEGISLATIVE DEPARTMENT - HOUSE OF REPRESENTATIVES"]
[null,null,"A150","LEGISLATIVE DEPARTMENT - CODIFICATION OF LAWS & LEGISLATIVE COUNCIL"]
[null,null,"A170","LEGISLATIVE DEPARTMENT - LEGISLATIVE SERVICES AGENCY"]
[null,null,"A200","LEGISLATIVE DEPARTMENT - LEGISLATIVE AUDIT COUNCIL"]
[null,null,"A850","EDUCATION OVERSIGHT COMMITTEE"]
[null,null,"B040","JUDICIAL DEPARTMENT"]
[null,null,"C050","ADMINISTRATIVE LAW JUDGES"]
[null,null,"D050","GOVERNOR'S OFFICE--EXECUTIVE CONTROL OF STATE"]
[null,null,"D100","GOVERNOR'S OFFICE--STATE LAW ENFORCEMENT DIVISION"]
[null,null,"D170","GOVERNOR'S OFFICE-- EXECUTIVE POLICY & PROGRAMS"]
[null,null,"D200","GOVERNOR'S OFFICE--MANSION & GROUNDS"]
[null,null,"D250","INSPECTOR GENERAL"]
[null,null,"D500","DEPARTMENT OF ADMINSTRATION"]
[null,null,"E040","LIEUTENANT GOVERNOR'S OFFICE"]
[null,null,"E080","SECRETARY OF STATE'S OFFICE"]
[null,null,"E120","COMPTROLLER GENERAL'S OFFICE\n"]
[null,null,"E160","STATE TREASURER'S OFFICE                                                                       "]
[null,null,"E190","RETIREMENT SYSTEM  INVESTMENT COMMISSION"]
[null,null,"E200","ATTORNEY GENERAL'S OFFICE"]
[null,null,"E210","PROSECUTION COORDINATION  COMMISSION"]
[null,null,"E230","COMMISSION ON INDIGENT DEFENSE "]
[null,null,"E240","ADJUTANT GENERAL'S OFFICE"]
[null,null,"E280","ELECTION COMMISSION"]
[null,null,"E500","REVENUE AND FISCAL AFFAIRS OFFICE"]
[null,null,"E550","STATE FISCAL ACCOUNTABILITY AUTHORITY"]
[null,null,"F270","STATE AUDITOR"]
[null,null,"H030","COMMISSION ON HIGHER EDUCATION"]
[null,null,"H060","HIGHER EDUCATION TUITION GRANTS COMMISSION"]
[null,null,"H590","BOARD FOR TECHNICAL & COMPREHENSIVE EDUCATION"]
{"$rows_left_out":66}
{"sheet":"2.1.1","index":2,"n_rows":391,"n_cols":11,"rows_kept":391,"cut":false,"hidden":false,"merged":[[6,6,6,13],[9,6,9,13],[11,6,11,13],[253,3,253,12],[266,3,266,12],[175,4,175,10],[236,4,236,10]]}
[null,null,"STATE OF SOUTH CAROLINA"]
[null,null,"YEAR-END REPORTING PACKAGE "]
[null,null,"SUBSEQUENT EVENT QUESTIONNAIRE"]
[null,null,null,null,null,null,null,null,null,"For the Fiscal Year Ended June 30, ",2019]
[]
[]
[null,null,"Agency:",{"$f":"+'Signature Page '!AgencyCode","v":0},null,null,{"$f":"+'Signature Page '!E6","v":""}]
[null,null,null,"Business Area",null,null,"Name"]
[]
[null,null,"Typed Preparer name:",null,null,null,{"$f":"+'Signature Page '!E11","v":0}]
[]
[null,null,"Typed Reviewer name:",null,null,null,{"$f":"+'Signature Page '!E18","v":0}]
[]
[]
[{"$f":"IF(B15=\"y\",COUNTA(B$14:B15),\"\")","v":""}]
[{"$f":"IF(B16=\"y\",COUNTA(B$14:B16),\"\")","v":""},null,"The following questions have been established in an outline hierarchy.  A NO response to a question advances to the "]
[{"$f":"IF(B17=\"y\",COUNTA(B$14:B17),\"\")","v":""},null,"next question of the same level (i.e. Number 1 response is NO move to Number 2, or NO is the response to part a "]
[{"$f":"IF(B18=\"y\",COUNTA(B$14:B18),\"\")","v":""},null,"of the question move to part b).  A YES response will require additional action through responses to additional "]
[{"$f":"IF(B19=\"y\",COUNTA(B$14:B19),\"\")","v":""},null,"questions at a sub-level, by completion of a Year-End Reporting Package, or by a requirement for submission of "]
[null,null,"additional information with this Checklist."]
[null,null,"Perform a review of the general ledger on an agency wide level and detail fund level to assist in accurately"]
[null,null,"responding to the questions on this reporting package."]
[]
[{"$f":"IF(B24=\"y\",COUNTA(B$14:B24),\"\")","v":1},"y"]
[{"$f":"IF(B25=\"y\",COUNTA(B$14:B25),\"\")","v":""},null,"Does your agency have ownership in investments that are not managed or accounted for by the State "]
[{"$f":"IF(B26=\"y\",COUNTA(B$14:B26),\"\")","v":""},null,"Treasurer's Office? "]
[]
[null,null,"a.  Have these investments experienced a loss since June 30? "]
[]
[null,null,"i.  Do the losses experienced since June 30 exceed 5% of the June 30 fair value? "]
[{"$f":"IF(B31=\"y\",COUNTA(B$14:B31),\"\")","v":""},null,null,"Action:  Provide to the Comptroller General's Office a copy of the most recent valuation "]
[{"$f":"IF(B32=\"y\",COUNTA(B$14:B32),\"\")","v":""},null,null,"statement reporting the investment loss."]
[{"$f":"IF(B33=\"y\",COUNTA(B$14:B33),\"\")","v":""}]
[{"$f":"IF(B34=\"y\",COUNTA(B$14:B34),\"\")","v":2},"y"]
[{"$f":"IF(B35=\"y\",COUNTA(B$14:B35),\"\")","v":""},null,"Did your agency collect and deposit any tax revenues subsequent to year-end?"]
[{"$f":"IF(B36=\"y\",COUNTA(B$14:B36),\"\")","v":""}]
[{"$f":"IF(B37=\"y\",COUNTA(B$14:B37),\"\")","v":""},null,"a.  Were any amounts reported as collectible been identified as uncollectible since submission"]
[{"$f":"IF(B38=\"y\",COUNTA(B$14:B38),\"\")","v":""},null,"of Section 3.02?"]
[{"$f":"IF(B39=\"y\",COUNTA(B$14:B39),\"\")","v":""},null,null,"Action: Provide to the Comptroller General's Office a summary by type of tax the amount"]
[{"$f":"IF(B40=\"y\",COUNTA(B$14:B40),\"\")","v":""},null,null,"that has been deemed uncollectible subsequent to submission of Section 3.02."]
[null,null,null,"Include a description of the situation, when the circumstances changed, and how"]
[null,null,null,"the agency identified the change in the situation."]
[{"$f":"IF(B43=\"y\",COUNTA(B$14:B43),\"\")","v":""}]
[]
[null,null,"b.  Have amounts been identified as receivables as of year-end in addition to the amounts submitted"]
[null,null,"on Section 3.02?"]
[null,null,null,"Action: Provide to the Comptroller General's Office a summary by type of tax of amounts"]
[null,null,null,"identified subsequent to submission of Section 3.02."]
[null,null,null,"Include a description of the situation, when the circumstances changed, and how"]
[null,null,null,"the agency identified the change in the situation."]
[]
[{"$f":"IF(B52=\"y\",COUNTA(B$14:B52),\"\")","v":3},"y"]
[null,null,"Did your agency report any receivables from federal or private grants or contracts or other "]
[{"$f":"IF(B54=\"y\",COUNTA(B$14:B54),\"\")","v":""},null,"contributions in Section 3.03?"]
[{"$f":"IF(B55=\"y\",COUNTA(B$14:B55),\"\")","v":""},null,"      "]
[{"$f":"IF(B56=\"y\",COUNTA(B$14:B56),\"\")","v":""},null,"a.  Were any amounts reported as collectible been identified as uncollectible since submission"]
[{"$f":"IF(B57=\"y\",COUNTA(B$14:B57),\"\")","v":""},null,"of Section 3.03?"]
[{"$f":"IF(B58=\"y\",COUNTA(B$14:B58),\"\")","v":""},null,null,"Action: Provide to the Comptroller General's Office a detailed list by grantor's grant number "]
[{"$f":"IF(B59=\"y\",COUNTA(B$14:B59),\"\")","v":""},null,null,"of amounts identified as uncollectible subsequent to submission of Section 3.03."]
[null,null,null,"Include a description of the situation, when the circumstances changed, and how"]
{"$rows_left_out":332}
{"sheet":"AP Worksheet ","index":3,"n_rows":126,"n_cols":26,"rows_kept":126,"cut":false,"hidden":false,"merged":[[14,4,14,22],[40,13,40,25],[0,0,0,23],[1,0,1,23],[5,7,5,25],[6,5,6,22],[8,5,8,10],[8,16,8,21]]}
["STATE OF SOUTH CAROLINA"]
["SUBSEQUENT EVENTS ACCOUNTS PAYABLE WORKSHEET"]
[null,null,null,null,null,null,null,null,null,null,null,null,"At June 30,",2019]
[]
[]
[null,null,"Agency:",null,null,null,null,{"$f":"IF(E6=\"\",\"\",VLOOKUP(E6,B49:C126,2,FALSE))","v":""}]
[null,null,null,null,"Business Area","Agency Name"]
[]
[null,"Preparer (Type Name):",null,null,null,null,null,null,null,null,null,null,null,"Reviewer (Type Name):"]
[]
[]
[null,"Use only if additional liabilities were identified subsequent to the submission of the forms in Section 3.12. Do not include payables already reported on the 3.12 package."]
[]
[null,"Provide the date through which the evaluation was performed."]
[null,null,null,null,"Dollar Amount in each Category"]
[null,"Fund",null,null,"Vendor",null,null,"Aid to ",null,null,"Sales or Use ",null,null,"Accrued ",null,null,"Intergovernmental",null,null,"Contract ",null,null,"Contract ",null,null,"Other Current "]
[null,"Number",null,null,"Payables",null,null,"Individuals ",null,null,"Tax Payables",null,null,"Expenses",null,null,"Payables",null,null,"Retentions",null,null,"Retentions",null,null,"Liabilities "]
[null,null,null,null,null,null,null,"Payables",null,null,null,null,null,null,null,null,null,null,null,"Current",null,null,"Non-current"]
[]
[null,null,null,"$",null,null,"$",null,null,"$",null,null,"$",null,null,"$",null,null,"$",null,null,"$",null,null,"$"]
[null,null,null,"$",null,null,"$",null,null,"$",null,null,"$",null,null,"$",null,null,"$",null,null,"$",null,null,"$"]
[null,null,null,"$",null,null,"$",null,null,"$",null,null,"$",null,null,"$",null,null,"$",null,null,"$",null,null,"$"]
[null,null,null,"$",null,null,"$",null,null,"$",null,null,"$",null,null,"$",null,null,"$",null,null,"$",null,null,"$"]
[null,null,null,"$",null,null,"$",null,null,"$",null,null,"$",null,null,"$",null,null,"$",null,null,"$",null,null,"$"]
[null,null,null,"$",null,null,"$",null,null,"$",null,null,"$",null,null,"$",null,null,"$",null,null,"$",null,null,"$"]
[null,null,null,"$",null,null,"$",null,null,"$",null,null,"$",null,null,"$",null,null,"$",null,null,"$",null,null,"$"]
[null,null,null,"$",null,null,"$",null,null,"$",null,null,"$",null,null,"$",null,null,"$",null,null,"$",null,null,"$"]
[null,null,null,"$",null,null,"$",null,null,"$",null,null,"$",null,null,"$",null,null,"$",null,null,"$",null,null,"$"]
[null,null,null,"$",null,null,"$",null,null,"$",null,null,"$",null,null,"$",null,null,"$",null,null,"$",null,null,"$"]
[null,null,null,"$",null,null,"$",null,null,"$",null,null,"$",null,null,"$",null,null,"$",null,null,"$",null,null,"$"]
[null,null,null,"$",null,null,"$",null,null,"$",null,null,"$",null,null,"$",null,null,"$",null,null,"$",null,null,"$"]
[null,null,null,"$",null,null,"$",null,null,"$",null,null,"$",null,null,"$",null,null,"$",null,null,"$",null,null,"$"]
[null,null,null,"$",null,null,"$",null,null,"$",null,null,"$",null,null,"$",null,null,"$",null,null,"$",null,null,"$"]
[null,null,null,"$",null,null,"$",null,null,"$",null,null,"$",null,null,"$",null,null,"$",null,null,"$",null,null,"$"]
[null,null,null,"$",null,null,"$",null,null,"$",null,null,"$",null,null,"$",null,null,"$",null,null,"$",null,null,"$"]
[null,null,null,"$",null,null,"$",null,null,"$",null,null,"$",null,null,"$",null,null,"$",null,null,"$",null,null,"$"]
[null,null,null,"$",null,null,"$",null,null,"$",null,null,"$",null,null,"$",null,null,"$",null,null,"$",null,null,"$"]
[null,null,null,"$",null,null,"$",null,null,"$",null,null,"$",null,null,"$",null,null,"$",null,null,"$",null,null,"$"]
[null,null,null,"$",null,null,"$",null,null,"$",null,null,"$",null,null,"$",null,null,"$",null,null,"$",null,null,"$"]
[]
[null,null,null,null,null,null,null,null,null,"Total (This Page)",{"$f":"SUM(E20:E39)+SUM(H20:H39)+SUM(K20:K39)+SUM(N20:N39)+SUM(Q20:Q39)+SUM(T20:T39)+SUM(W20:W39)+SUM(Z20:Z39)","v":0}]
[]
[]
["NOTE:  If additional space is needed, please click the button.",null,null,null,null,null,null,null,null,null,null,null,null,null,"MUST ENABLE MACROS"]
[]
[]
[]
[null,"AGCY  CODE","AGENCY NAME"]
[null,"A010","LEGISLATIVE DEPARTMENT - THE SENATE"]
[null,"A050","LEGISLATIVE DEPARTMENT - HOUSE OF REPRESENTATIVES"]
[null,"A150","LEGISLATIVE DEPARTMENT - CODIFICATION OF LAWS & LEGISLATIVE COUNCIL"]
[null,"A170","LEGISLATIVE DEPARTMENT - LEGISLATIVE SERVICES AGENCY"]
[null,"A200","LEGISLATIVE DEPARTMENT - LEGISLATIVE AUDIT COUNCIL"]
[null,"A850","EDUCATION OVERSIGHT COMMITTEE"]
[null,"B040","JUDICIAL DEPARTMENT"]
[null,"C050","ADMINISTRATIVE LAW COURT"]
[null,"D050","GOVERNOR'S OFFICE--EXECUTIVE CONTROL OF STATE"]
[null,"D100","STATE LAW ENFORCEMENT DIVISION"]
[null,"D170","GOVERNOR'S OFFICE-- EXECUTIVE POLICY & PROGRAMS"]
[null,"D200","GOVERNOR'S OFFICE--MANSION & GROUNDS"]
{"$rows_left_out":67}
{"sheet":"AP Worksheet","index":4,"n_rows":120,"n_cols":26,"rows_kept":120,"cut":false,"hidden":true,"merged":[[12,4,12,22],[0,0,0,23],[1,0,1,23],[5,7,5,25],[6,5,6,22],[8,5,8,10],[8,16,8,21]]}
["STATE OF SOUTH CAROLINA"]
["ACCOUNTS PAYABLE SUMMARY FORM"]
[null,null,null,null,null,null,null,null,null,null,null,null,"At June 30,",{"$f":"IF(Year=\"\",\"\",Year)","v":{"$error":"#REF!"}}]
[]
[]
[null,null,"Agency:",null,{"$f":"IF('AP Worksheet '!E6=\"\",\"\",'AP Worksheet '!E6)","v":""},null,null,{"$f":"IF('AP Worksheet '!H6:Z6=\"\",\"\",'AP Worksheet '!H6:Z6)","v":""}]
[null,null,null,null,"Business Area","Agency Name"]
[]
[null,"Preparer (Type Name):",null,null,null,{"$f":"IF('AP Worksheet '!F9:K9=\"\",\"\",'AP Worksheet '!F9:K9)","v":""},null,null,null,null,null,null,null,"Reviewer (Type Name):",null,null,{"$f":"IF('AP Worksheet '!Q9:V9=\"\",\"\",'AP Worksheet '!Q9:V9)","v":""}]
[]
[]
[]
[null,null,null,null,"Dollar Amount in each Category"]
[null,"Fund",null,null,"Vendor",null,null,"Aid to ",null,null,"Sales or Use ",null,null,"Accrued ",null,null,"Intergovernmental",null,null,"Contract ",null,null,"Contract ",null,null,"Other Current "]
[null,"Number",null,null,"Payables",null,null,"Individuals ",null,null,"Tax Payables",null,null,"Expenses",null,null,"Payables",null,null,"Retentions",null,null,"Retentions",null,null,"Liabilities "]
[null,null,null,null,null,null,null,"Payables",null,null,null,null,null,null,null,null,null,null,null,"Current",null,null,"Non-current"]
[]
[null,null,null,"$",null,null,"$",null,null,"$",null,null,"$",null,null,"$",null,null,"$",null,null,"$",null,null,"$"]
[null,null,null,"$",null,null,"$",null,null,"$",null,null,"$",null,null,"$",null,null,"$",null,null,"$",null,null,"$"]
[null,null,null,"$",null,null,"$",null,null,"$",null,null,"$",null,null,"$",null,null,"$",null,null,"$",null,null,"$"]
[null,null,null,"$",null,null,"$",null,null,"$",null,null,"$",null,null,"$",null,null,"$",null,null,"$",null,null,"$"]
[null,null,null,"$",null,null,"$",null,null,"$",null,null,"$",null,null,"$",null,null,"$",null,null,"$",null,null,"$"]
[null,null,null,"$",null,null,"$",null,null,"$",null,null,"$",null,null,"$",null,null,"$",null,null,"$",null,null,"$"]
[null,null,null,"$",null,null,"$",null,null,"$",null,null,"$",null,null,"$",null,null,"$",null,null,"$",null,null,"$"]
[null,null,null,"$",null,null,"$",null,null,"$",null,null,"$",null,null,"$",null,null,"$",null,null,"$",null,null,"$"]
[null,null,null,"$",null,null,"$",null,null,"$",null,null,"$",null,null,"$",null,null,"$",null,null,"$",null,null,"$"]
[null,null,null,"$",null,null,"$",null,null,"$",null,null,"$",null,null,"$",null,null,"$",null,null,"$",null,null,"$"]
[null,null,null,"$",null,null,"$",null,null,"$",null,null,"$",null,null,"$",null,null,"$",null,null,"$",null,null,"$"]
[null,null,null,"$",null,null,"$",null,null,"$",null,null,"$",null,null,"$",null,null,"$",null,null,"$",null,null,"$"]
[null,null,null,"$",null,null,"$",null,null,"$",null,null,"$",null,null,"$",null,null,"$",null,null,"$",null,null,"$"]
[null,null,null,"$",null,null,"$",null,null,"$",null,null,"$",null,null,"$",null,null,"$",null,null,"$",null,null,"$"]
[null,null,null,"$",null,null,"$",null,null,"$",null,null,"$",null,null,"$",null,null,"$",null,null,"$",null,null,"$"]
[null,null,null,"$",null,null,"$",null,null,"$",null,null,"$",null,null,"$",null,null,"$",null,null,"$",null,null,"$"]
[null,null,null,"$",null,null,"$",null,null,"$",null,null,"$",null,null,"$",null,null,"$",null,null,"$",null,null,"$"]
[null,null,null,"$",null,null,"$",null,null,"$",null,null,"$",null,null,"$",null,null,"$",null,null,"$",null,null,"$"]
[null,null,null,"$",null,null,"$",null,null,"$",null,null,"$",null,null,"$",null,null,"$",null,null,"$",null,null,"$"]
[null,null,null,"$",null,null,"$",null,null,"$",null,null,"$",null,null,"$",null,null,"$",null,null,"$",null,null,"$"]
[]
[null,null,null,null,null,null,null,null,null,"Total (This Page)",{"$f":"SUM(E18:E37)+SUM(H18:H37)+SUM(K18:K37)+SUM(N18:N37)+SUM(Q18:Q37)+SUM(T18:T37)+SUM(W18:W37)+SUM(Z18:Z37)","v":0}]
[]
["NOTE:  If additional space is needed, please click the button.",null,null,null,null,null,null,null,null,null,null,null,null,null,"MUST ENABLE MACROS"]
[]
[]
[]
[null,"AGCY  CODE","AGENCY NAME"]
[null,"A01","LEGISLATIVE DEPARTMENT - THE SENATE"]
[null,"A05","LEGISLATIVE DEPARTMENT - HOUSE OF REPRESENTATIVES"]
[null,"A15","LEGISLATIVE DEPARTMENT - CODIFICATION OF LAWS & LEGISLATIVE COUNCIL"]
[null,"A17","LEGISLATIVE DEPARTMENT - LEGISLATIVE PRINTING & INFORMATION TECHNICAL SYSTEMS"]
[null,"A20","LEGISLATIVE DEPARTMENT - LEGISLATIVE AUDIT COUNCIL"]
[null,"A85","EDUCATION OVERSIGHT COMMITTEE"]
[null,"B04","JUDICIAL DEPARTMENT"]
[null,"C05","ADMINISTRATIVE LAW JUDGES"]
[null,"D05","GOVERNOR'S OFFICE--EXECUTIVE CONTROL OF STATE"]
[null,"D10","GOVERNOR'S OFFICE--STATE LAW ENFORCEMENT DIVISION"]
[null,"D17","GOVERNOR'S OFFICE-- EXECUTIVE POLICY & PROGRAMS"]
[null,"D20","GOVERNOR'S OFFICE--MANSION & GROUNDS"]
[null,"D25","INSPECTOR GENERAL"]
[null,"E04","LIEUTENANT GOVERNOR'S OFFICE"]
[null,"E08","SECRETARY OF STATE'S OFFICE"]
{"$rows_left_out":60}