{"text_format":"1","workbook":"xlsx","n_sheets":9,"sheets":["Yearly Data","Instructions","Signature Page","2.0.1","Required Packages","Resources","Summary","42. (Cont)","44. (Cont)"],"not_rendered":{"charts":0,"images":0,"macros":1,"external_links":0,"defined_names":5,"comments":0,"pivot_tables":0},"unopened":[],"bounds":{"document_bytes":16777216,"sheet_cells":100000,"rows_first":2000,"rows_last":500,"rows_between":2000,"halvings":0,"cell_chars":16384,"cell_head_chars":4096},"cells_cut":0,"cells_raw":0,"read":"whole","date_system":"1900"}

{"sheet":"Yearly Data","index":0,"n_rows":88,"n_cols":3,"rows_kept":88,"cut":false,"hidden":true,"merged":[]}
["Year",2021]
[]
[]
["The following information must be reviewed and updated as necessary anually:"]
[]
["AGCY  CODE","AGENCY NAME","FY Added"]
["A010","LEGISLATIVE DEPARTMENT - THE SENATE"]
["A050","LEGISLATIVE DEPARTMENT - HOUSE OF REPRESENTATIVES"]
["A150","LEGISLATIVE DEPARTMENT - CODIFICATION OF LAWS & LEGISLATIVE COUNCIL"]
["A170","LEGISLATIVE DEPARTMENT - LEGISLATIVE SERVICES AGENCY"]
["A200","LEGISLATIVE DEPARTMENT - LEGISLATIVE AUDIT COUNCIL"]
["A850","EDUCATION OVERSIGHT COMMITTEE"]
["B040","JUDICIAL DEPARTMENT"]
["C050","ADMINISTRATIVE LAW JUDGES"]
["D050","GOVERNOR'S OFFICE--EXECUTIVE CONTROL OF STATE"]
["D100","GOVERNOR'S OFFICE--STATE LAW ENFORCEMENT DIVISION"]
["D170","GOVERNOR'S OFFICE-- EXECUTIVE POLICY & PROGRAMS"]
["D200","GOVERNOR'S OFFICE--MANSION & GROUNDS"]
["D250","INSPECTOR GENERAL"]
["D500","DEPARTMENT OF ADMINSTRATION"]
{"$rows_left_out":69}
{"sheet":"Instructions","index":1,"n_rows":108,"n_cols":10,"rows_kept":108,"cut":false,"hidden":false,"merged":[]}
["MASTER REPORTING PACKAGE CHECKLIST"]
["INSTRUCTIONS FOR COMPLETION"]
["Form 2.0.1"]
[null,"DUE DATE:",null,"2021-07-09"]
[]
[null,"PURPOSE AND OBJECTIVES"]
[null,"The purpose of this year-end reporting package is to help agencies determine which reporting packages"]
[null,"are required.  It also tells the Comptroller General's Office which reporting packages to expect from"]
[null,"an agency."]
[]
[null,"THIS FORM SHOULD NOT BE COMPLETED BY THE FOLLOWING:"]
[null,"Exempt entities:"]
[null,"F30 Employee Benefits Fund"]
[null,"F31 Capital Expenditure Fund"]
[null,"Audited Financial Statement Entities:"]
[null,"Department of Employment Workforce (Unemployment Compensation Benefits Fund Only)"]
[null,"Colleges, Universities, and Technical Colleges"]
[null,"Children's Trust of South Carolina"]
[null,"Department of Commerce, Division of Public Railways"]
[null,"Department of Commerce, Division of Savannah Valley Development"]
{"$rows_left_out":89}
{"sheet":"Signature Page","index":2,"n_rows":41,"n_cols":6,"rows_kept":41,"cut":false,"hidden":false,"merged":[[40,1,40,5],[26,3,26,4],[28,0,28,5],[32,1,32,5],[34,1,34,5],[36,1,36,5],[38,1,38,5]]}
[null,null,"Master Reporting Package Checklist Signature Page"]
[]
[]
[null,null,"CAFR Reporting Period:",null,{"$f":"TEXT(DUEDATE,\"YYYY\")","v":"2021"}]
[null,null,"Agency Number:",null,"E120",{"$f":"IF(AgencyCode=\"\",\"*\",\"\")","v":""}]
[null,null,"Agency Name",null,{"$f":"IF(ISERROR(VLOOKUP(E5,'Yearly Data'!A7:B88,2,FALSE))=TRUE,\"\",VLOOKUP(E5,'Yearly Data'!A7:B88,2,FALSE))","v":"COMPTROLLER GENERAL'S OFFICE\n"}]
[]
[]
[]
[null,null,"Preparer","Date:","2021-07-08",{"$f":"IF(E10=\"\",\"*\",\"\")","v":""}]
[null,null,null,"Name:","Agency Preparer",{"$f":"IF(E11=\"\",\"*\",\"\")","v":""}]
[null,null,null,"Title:","Fiscal Manager",""]
[null,null,null,"e-mail:","agencypreparer@agency.gov",""]
[null,null,null,"Phone Number:","803 123-4567",""]
[null,null,null,"Signature:",null,"*"]
[]
[null,null,"Reviewer",null,"2021-07-09",{"$f":"IF(E17=\"\",\"*\",\"\")","v":""}]
[null,null,null,"Date Reviewed:","2021-07-08",""]
[null,null,null,"Name:","Agency Reviewer",""]
[null,null,null,"Title:","Director of Finance",""]
{"$rows_left_out":22}
{"sheet":"2.0.1","index":3,"n_rows":495,"n_cols":10,"rows_kept":495,"cut":false,"hidden":false,"merged":[[19,2,19,5],[12,2,12,5],[13,2,13,5],[15,2,15,5],[16,2,16,5],[17,2,17,5],[18,2,18,5],[11,2,11,5],[5,2,5,6],[6,2,6,5],[7,2,7,5],[9,2,9,5],[10,2,10,5],[3,0,3,7],[2,0,2,7],[1,0,1,7],[0,0,0,7],[4,0,4,7]]}
["STATE OF SOUTH CAROLINA"]
["YEAR-END REPORTING PACKAGE "]
["MASTER REPORTING PACKAGE CHECKLIST"]
[{"$f":"\"For the Fiscal Year Ended June 30, \"&Year","v":"For the Fiscal Year Ended June 30, 2021"}]
[]
["DUE",null,{"$f":"CONCATENATE(TEXT(DUEDATE,\"DDDD\"),\", \",TEXT(DUEDATE,\"M/D/YYYY\"))","v":"Friday, 7/9/2021"}]
["Agency:",null,{"$f":"IF(AgencyCode=\"\",\"\",AgencyCode)","v":"E120"}]
[null,null,{"$f":"IF(AgencyName=\"\",\"\",AgencyName)","v":"COMPTROLLER GENERAL'S OFFICE\n"}]
[]
["Preparer",null,{"$f":"IF('Signature Page'!E11=\"\",\"\",'Signature Page'!E11)","v":"Agency Preparer"}]
["Title",null,{"$f":"IF('Signature Page'!E12=\"\",\"\",'Signature Page'!E12)","v":"Fiscal Manager"}]
["Date",null,{"$f":"IF('Signature Page'!E10=\"\",\"\",'Signature Page'!E10)","v":"2021-07-08"}]
["email:",null,{"$f":"IF('Signature Page'!E13=\"\",\"\",'Signature Page'!E13)","v":"agencypreparer@agency.gov"}]
["Phone:",null,{"$f":"IF('Signature Page'!E14=\"\",\"\",'Signature Page'!E14)","v":"803 123-4567"}]
[]
["Reviewer",null,{"$f":"IF('Signature Page'!E19=\"\",\"\",'Signature Page'!E19)","v":"Agency Reviewer"}]
["Title",null,{"$f":"IF('Signature Page'!E20=\"\",\"\",'Signature Page'!E20)","v":"Director of Finance"}]
["Date",null,{"$f":"IF('Signature Page'!E17=\"\",\"\",'Signature Page'!E17)","v":"2021-07-09"}]
["email:",null,{"$f":"IF('Signature Page'!E21=\"\",\"\",'Signature Page'!E21)","v":"agencyreviewer@agency.gov"}]
["Phone:",null,{"$f":"IF('Signature Page'!E22=\"\",\"\",'Signature Page'!E22)","v":"803 123-4567"}]
{"$rows_left_out":476}
{"sheet":"Required Packages","index":4,"n_rows":112,"n_cols":5,"rows_kept":112,"cut":false,"hidden":false,"merged":[[6,0,6,4],[0,0,0,4],[4,0,4,4],[3,0,3,4],[1,0,1,4],[2,0,2,4]]}
["STATE OF SOUTH CAROLINA"]
["YEAR-END REPORTING PACKAGE "]
["MASTER REPORTING PACKAGE CHECKLIST"]
["SUMMARY OF REQUIRED PACKAGES AND ADDITIONAL DOCUMENTATION"]
[{"$f":"\"For the Fiscal Year Ended June 30, \"&Year","v":"For the Fiscal Year Ended June 30, 2021"}]
[]
[{"$f":"\"For\"&\" \"&AgencyCode&\", \"&AgencyName","v":"For E120, COMPTROLLER GENERAL'S OFFICE\n"}]
[]
["Reporting Packages",null,null,"Submission Date"]
[]
["2.01 Subsequent Events Reporting Package",null,null,{"$f":"\"Due\"&\" \"&(Resources!D3)","v":"Due October 22"},{"$f":"\"Note: Package is not to be submitted before\"&\" \"&TEXT(Resources!E3,\"m/d/yyyy\")","v":"Note: Package is not to be submitted before 10/8/2021"}]
["3.01 Cash and Investments Reporting Package",null,null,{"$f":"IF(OR(E13=\"Yes\",E14=\"Yes\",E15=\"Yes\")=FALSE,\"Not Required\",\"Due\"&\" \"&Resources!D4)","v":"Due July 23"}]
[null,"3.01.1","Petty Cash",null,{"$f":"IF(COUNTIF('2.0.1'!G51:G55,\"Yes\")>0,\"Yes\",IF('2.0.1'!G55=\"No\",\"No\",IF('2.0.1'!G55=\"\",\"\",\"ERROR\")))","v":"Yes"}]
[null,"3.01.2","Agency Cash",null,{"$f":"IF('2.0.1'!G59=\"Yes\",\"Yes\",IF('2.0.1'!G59=\"No\",\"No\",IF('2.0.1'!G59=\"\",\"\",\"ERROR\")))","v":"Yes"}]
[null,"3.01.3","Investments",null,{"$f":"IF('2.0.1'!G63=\"Yes\",\"Yes\",IF('2.0.1'!G63=\"No\",\"No\",IF('2.0.1'!G63=\"\",\"\",\"ERROR\")))","v":"Yes"}]
["3.02 Tax Revenue Reporting Package",null,null,{"$f":"IF(OR(E17=\"Yes\",E18=\"Yes\",E19=\"Yes\")=FALSE,\"Not Required\",\"Due\"&\" \"&Resources!D5)","v":"Due August 13"}]
[null,"3.02.1","Tax Receivable",null,{"$f":"IF('2.0.1'!G69=\"Yes\",\"Yes\",IF('2.0.1'!G69=\"No\",\"No\",IF('2.0.1'!G69=\"\",\"\",\"ERROR\")))","v":"Yes"}]
[null,"3.02.2","Tax Refund Payable",null,{"$f":"IF('2.0.1'!G69=\"Yes\",\"Yes\",IF('2.0.1'!G69=\"No\",\"No\",IF('2.0.1'!G69=\"\",\"\",\"ERROR\")))","v":"Yes"}]
[null,"3.02.3","Deferred Tax Revenues",null,{"$f":"IF('2.0.1'!G69=\"Yes\",\"Yes\",IF('2.0.1'!G69=\"No\",\"No\",IF('2.0.1'!G69=\"\",\"\",\"ERROR\")))","v":"Yes"}]
["3.03 Grants and Contribution Revenue Reporting Package",null,null,{"$f":"IF(OR(E21=\"Yes\",E22=\"Yes\",E23=\"Yes\")=FALSE,\"Not Required\",\"Due\"&\" \"&Resources!D6)","v":"Due September 10"}]
{"$rows_left_out":93}
{"sheet":"Resources","index":5,"n_rows":21,"n_cols":9,"rows_kept":21,"cut":false,"hidden":false,"merged":[[0,2,0,3],[13,0,14,0],[13,1,14,1],[13,2,14,2],[13,7,14,7],[13,3,14,3]]}
["Package","Package Name","Package Due Day & Date",null,"Not Before","SCEIS Report Distribution Date","SCEIS Report Name ","CG's Office Contact","Phone Number"]
[2,"Master Reporting Package Checklist",{"$f":"TEXT(D2,\"dddd\")","v":"Friday"},"July 9",null,null,null,"Kelly Ghent","803-734-0272"]
[2.1,"Subsequent Event ","Friday","October 22","October 8",null,null,"Michael Moore","803-734-0584"]
[3.01,"Cash and Investments","Friday","July 23",null,"July 9","Yearend Rptg - Cash & Investments","Katherine Kip","803-734-5043"]
[3.02,"Tax Revenue","Friday","August 13",null,null,null,"Michael Moore","803-734-0584"]
[3.03,"Grant and Contributions Revenue","Friday","September 10",null,"September 1","Yearend Rptg - AR (Contributions)\nYearend Rptg - Schedule of Expenditures of Fed Awards (SEFA)","Michael Moore","803-734-0584"]
[3.04,"Other Receivables","Friday","August 13",null,"July 30","Yearend Rptg – Accounts Receivable Current with Customer","Kelly Ghent","803-734-0272"]
[3.05,"Unearned Revenue","Friday","August 20",null,null,null,"Michael Moore","803-734-0272"]
[3.06,"Inventory","Friday","August 13",null,"July 30","Yearend Rptg - AR (Contributions)","Kelly Ghent","803-734-0272"]
[3.07,"Prepaid Expenses","Friday","August 20",null,"August 6","Yearend Rptg - Prepaid Expenses","Kelly Ghent","803-734-0272"]
[3.08,"Capital Assets","Friday","September 10",null,"August 30","Yearend Rptg - Asset History Sheet","Kelly Ghent","803-734-0272"]
[3.09,"Operating Leases","Friday","August 20",null,"August 6","Yearend Rptg - Operating Lease Expense w/Vendor","Kelly Ghent","803-734-0272"]
[3.1,"Loans Receivable","Friday","July 23",null,null,null,"Katherine Kip","803-734-5043"]
[3.12,"Accounts Payable",{"$f":"TEXT(D14,\"dddd\")","v":"Friday"},"September 10",null,"September 1","Yearend Rptg - Prior Year Payables with Vendor","Kelly Ghent","803-734-0272"]
[null,null,null,null,null,"September 8","Yearend Rptg - Prior Year Payables with Vendor",null,"803-734-0272"]
[3.13,"Litigation","Friday","July 23",null,"July 9","Yearend Rpt - Litigation Expense","Michael Moore","803-734-0584"]
[3.14,"Disallowances and Penalties","Friday","July 23",null,null,null,"Kelly Ghent","803-734-0272"]
[3.15,"Claims","Friday","August 6",null,null,null,"David Starkey","803-734-2542"]
[3.16,"Misc Loss Liabilities","Friday","August 13",null,null,null,"Katherine Kip","803-734-5043"]
[3.18,"Interfund Payable","Friday","August 20",null,"July 30","Yearend Rptg - Inter-Agency Prior Year Payables with Vendor","David Starkey","803-734-2542"]
{"$rows_left_out":2}
{"sheet":"Summary","index":6,"n_rows":460,"n_cols":7,"rows_kept":460,"cut":false,"hidden":true,"merged":[]}
["Worksheet","Agnecy Code","Agency Name","Year","QUESTION #","QUESTION","Answers"]
["2.0.1",{"$f":"AgencyCode","v":"E120"},{"$f":"AgencyName","v":"COMPTROLLER GENERAL'S OFFICE\n"},{"$f":"Year","v":2021},{"$f":"'2.0.1'!A32","v":2},{"$f":"'2.0.1'!C32","v":"Each agency is responsible for designing and implementing processes, procedures, and controls to record and provide accurate and timely accounting information and to prevent and detect fraud.  As part of Best Practices for Internal Control, a review of the agency's general ledger either in detail or at a trial balance level should be performed at the beginning of the yearly closing procedures."},{"$f":"IF('2.0.1'!G32=\"\",\"\",'2.0.1'!G32)","v":""}]
["2.0.1","E120","COMPTROLLER GENERAL'S OFFICE\n",2021,{"$f":"IF('2.0.1'!A34=\"\",E2,'2.0.1'!A34)","v":2},{"$f":"IF('2.0.1'!C34=\"\",\"\",'2.0.1'!C34)","v":"a.  Has a review of general ledger balances been performed at an agency wide level? "},{"$f":"IF('2.0.1'!G34=\"\",\"\",'2.0.1'!G34)","v":"Yes"}]
["2.0.1","E120","COMPTROLLER GENERAL'S OFFICE\n",2021,{"$f":"IF('2.0.1'!A36=\"\",E3,'2.0.1'!A36)","v":2},{"$f":"IF('2.0.1'!C36=\"\",\"\",'2.0.1'!C36)","v":"b.  Were any errors identified in the review performed for the beginning of year-end close for the current year ended June 30?"},{"$f":"IF('2.0.1'!G36=\"\",\"\",'2.0.1'!G36)","v":"No"}]
["2.0.1","E120","COMPTROLLER GENERAL'S OFFICE\n",2021,{"$f":"IF('2.0.1'!A38=\"\",E4,'2.0.1'!A38)","v":2},{"$f":"IF('2.0.1'!C38=\"\",\"\",'2.0.1'!C38)","v":"Action:  Perform sufficient analysis and evaluation to identify and correct the errors prior to submission of related reporting package forms and the close of access to the general ledger.  "},{"$f":"IF('2.0.1'!G38=\"\",\"\",'2.0.1'!G38)","v":""}]
["2.0.1","E120","COMPTROLLER GENERAL'S OFFICE\n",2021,{"$f":"IF('2.0.1'!A41=\"\",E5,'2.0.1'!A41)","v":3},{"$f":"IF('2.0.1'!C41=\"\",\"\",'2.0.1'!C41)","v":"As part of Best Practices for Internal Control, a review of the general ledger by detailed fund should be performed at the beginning and ending of the yearly closing procedures."},{"$f":"IF('2.0.1'!G41=\"\",\"\",'2.0.1'!G41)","v":""}]
["2.0.1","E120","COMPTROLLER GENERAL'S OFFICE\n",2021,{"$f":"IF('2.0.1'!A43=\"\",E6,'2.0.1'!A43)","v":3},{"$f":"IF('2.0.1'!C43=\"\",\"\",'2.0.1'!C43)","v":"a.  Has a review of general ledger balances been performed at the accounting (detailed) fund level? "},{"$f":"IF('2.0.1'!G43=\"\",\"\",'2.0.1'!G43)","v":"Yes"}]
["2.0.1","E120","COMPTROLLER GENERAL'S OFFICE\n",2021,{"$f":"IF('2.0.1'!A45=\"\",E7,'2.0.1'!A45)","v":3},{"$f":"IF('2.0.1'!C45=\"\",\"\",'2.0.1'!C45)","v":"b.  Were any errors identified in the review by fund for the beginning of year-end close for the current year ended June 30?"},{"$f":"IF('2.0.1'!G45=\"\",\"\",'2.0.1'!G45)","v":"No"}]
["2.0.1","E120","COMPTROLLER GENERAL'S OFFICE\n",2021,{"$f":"IF('2.0.1'!A47=\"\",E8,'2.0.1'!A47)","v":3},{"$f":"IF('2.0.1'!C47=\"\",\"\",'2.0.1'!C47)","v":"Action:  Perform sufficient analysis and evaluation to identify and correct the errors prior to submission of related reporting package forms and the close of access to the general ledger.  "},{"$f":"IF('2.0.1'!G47=\"\",\"\",'2.0.1'!G47)","v":""}]
["2.0.1","E120","COMPTROLLER GENERAL'S OFFICE\n",2021,{"$f":"IF('2.0.1'!A55=\"\",E9,'2.0.1'!A55)","v":5},{"$f":"IF('2.0.1'!C55=\"\",\"\",'2.0.1'!C55)","v":"Does your agency have G/L account 1000050000 Petty Cash present on your Trial Balance (regardless of balance)?"},{"$f":"IF('2.0.1'!G55=\"\",\"\",'2.0.1'!G55)","v":"Yes"}]
["2.0.1","E120","COMPTROLLER GENERAL'S OFFICE\n",2021,{"$f":"IF('2.0.1'!A57=\"\",E10,'2.0.1'!A57)","v":5},{"$f":"IF('2.0.1'!C57=\"\",\"\",'2.0.1'!C57)","v":"Action:  A Cash and Investments Reporting Package is required.  (See Section 3.01)"},{"$f":"IF('2.0.1'!G57=\"\",\"\",'2.0.1'!G57)","v":""}]
["2.0.1","E120","COMPTROLLER GENERAL'S OFFICE\n",2021,{"$f":"IF('2.0.1'!A59=\"\",E11,'2.0.1'!A59)","v":6},{"$f":"IF('2.0.1'!C59=\"\",\"\",'2.0.1'!C59)","v":"Does your agency have cash held in a bank account (including composite reservoir accounts) for which it receives periodic statements directly from the bank (cash on deposit with banks)?"},{"$f":"IF('2.0.1'!G59=\"\",\"\",'2.0.1'!G59)","v":"Yes"}]
["2.0.1","E120","COMPTROLLER GENERAL'S OFFICE\n",2021,{"$f":"IF('2.0.1'!A61=\"\",E12,'2.0.1'!A61)","v":6},{"$f":"IF('2.0.1'!C61=\"\",\"\",'2.0.1'!C61)","v":"Action:  A Cash and Investments Reporting Package is required.  (See Section 3.01)"},{"$f":"IF('2.0.1'!G61=\"\",\"\",'2.0.1'!G61)","v":""}]
["2.0.1","E120","COMPTROLLER GENERAL'S OFFICE\n",2021,{"$f":"IF('2.0.1'!A63=\"\",E13,'2.0.1'!A63)","v":7},{"$f":"IF('2.0.1'!C63=\"\",\"\",'2.0.1'!C63)","v":"Does your agency have ownership in investments that are not managed or accounted for by the State Treasurer's Office? "},{"$f":"IF('2.0.1'!G63=\"\",\"\",'2.0.1'!G63)","v":"Yes"}]
["2.0.1","E120","COMPTROLLER GENERAL'S OFFICE\n",2021,{"$f":"IF('2.0.1'!A65=\"\",E14,'2.0.1'!A65)","v":7},{"$f":"IF('2.0.1'!C65=\"\",\"\",'2.0.1'!C65)","v":"Action:  A Cash and Investments Reporting Package is required.  (See Section 3.01)"},{"$f":"IF('2.0.1'!G65=\"\",\"\",'2.0.1'!G65)","v":""}]
["2.0.1","E120","COMPTROLLER GENERAL'S OFFICE\n",2021,{"$f":"IF('2.0.1'!A69=\"\",E15,'2.0.1'!A69)","v":8},{"$f":"IF('2.0.1'!C69=\"\",\"\",'2.0.1'!C69)","v":"Did your agency collect and deposit any tax revenues during the fiscal year?  (If you collect sales taxes that are remitted to the South Carolina Department of Revenue for items sold in a gift shop, please answer no for this question.)"},{"$f":"IF('2.0.1'!G69=\"\",\"\",'2.0.1'!G69)","v":"Yes"}]
["2.0.1","E120","COMPTROLLER GENERAL'S OFFICE\n",2021,{"$f":"IF('2.0.1'!A71=\"\",E16,'2.0.1'!A71)","v":8},{"$f":"IF('2.0.1'!C71=\"\",\"\",'2.0.1'!C71)","v":"Action: A Tax Revenues Reporting Package is required.  (See Section 3.02)"},{"$f":"IF('2.0.1'!G71=\"\",\"\",'2.0.1'!G71)","v":""}]
["2.0.1","E120","COMPTROLLER GENERAL'S OFFICE\n",2021,{"$f":"IF('2.0.1'!A79=\"\",E17,'2.0.1'!A79)","v":10},{"$f":"IF('2.0.1'!C79=\"\",\"\",'2.0.1'!C79)","v":"Did your agency receive resources from the federal government or other private granting organizations under an agreement which constitutes the service as a cash conduit (see Reporting Manual for further guidance on what constitutes a cash conduit) during the year?"},{"$f":"IF('2.0.1'!G79=\"\",\"\",'2.0.1'!G79)","v":"No"}]
["2.0.1","E120","COMPTROLLER GENERAL'S OFFICE\n",2021,{"$f":"IF('2.0.1'!A81=\"\",E18,'2.0.1'!A81)","v":10},{"$f":"IF('2.0.1'!C81=\"\",\"\",'2.0.1'!C81)","v":"Action:  A schedule of the total amount, by fund, passed through to non-State entities (as a cash conduit) is to be returned to the Comptroller General's Office with the Grants and Contributions Reporting Package.  "},{"$f":"IF('2.0.1'!G81=\"\",\"\",'2.0.1'!G81)","v":""}]
["2.0.1","E120","COMPTROLLER GENERAL'S OFFICE\n",2021,{"$f":"IF('2.0.1'!A84=\"\",E19,'2.0.1'!A84)","v":11},{"$f":"IF('2.0.1'!C84=\"\",\"\",'2.0.1'!C84)","v":"Did your agency receive funding from federal or private granting organizations through grant awards or contracts during the year?"},{"$f":"IF('2.0.1'!G84=\"\",\"\",'2.0.1'!G84)","v":"Yes"}]
{"$rows_left_out":441}
{"sheet":"42. (Cont)","index":7,"n_rows":17,"n_cols":25,"rows_kept":17,"cut":false,"hidden":true,"merged":[]}
[]
["42. (Cont)"]
[]
[null,"a.",null,null,null,null,"Escrow Account 1",null,"Escrow Account 2",null,"Escrow Account 3",null,"Escrow Account 4",null,"Escrow Account 5",null,"Escrow Account 6",null,"Escrow Account 7",null,"Escrow Account 8",null,"Escrow Account 9",null,"Escrow Account 10"]
[]
[null,null,"Lease ID #"]
[null,null,"Amount held in escrow"]
[]
[]
[null,null,null,null,null,null,"Escrow Account 1",null,"Escrow Account 2",null,"Escrow Account 3",null,"Escrow Account 4",null,"Escrow Account 5",null,"Escrow Account 6",null,"Escrow Account 7",null,"Escrow Account 8",null,"Escrow Account 9",null,"Escrow Account 10"]
[]
[null,"b.","Lease ID #(s)"]
[null,null,"Date the escrow account was closed"]
[]
[]
[]
[null,null,"Note:  Space for ten additional open and closed escrow accounts have been provided.  If you need additional space, please contact the CG's Office."]

{"sheet":"44. (Cont)","index":8,"n_rows":11,"n_cols":45,"rows_kept":11,"cut":false,"hidden":true,"merged":[[2,30,2,32],[2,34,2,36],[2,38,2,40],[2,42,2,44],[2,6,2,8],[2,10,2,12],[2,14,2,16],[2,18,2,20],[2,22,2,24],[2,26,2,28]]}
[]
["44. (Cont)"]
[null,null,null,null,null,null,"Additional Agreement 1",null,null,null,"Additional Agreement 2",null,null,null,"Additional Agreement 3",null,null,null,"Additional Agreement 4",null,null,null,"Additional Agreement 5",null,null,null,"Additional Agreement 6",null,null,null,"Additional Agreement 7",null,null,null,"Additional Agreement 8",null,null,null,"Additional Agreement 9",null,null,null,"Additional Agreement 10"]
[null,"Action:  Provide the following information "]
[null,null,"Principle amount"]
[null,null,null,null,null,null,"General Ledger Account",null,"Amount",null,"General Ledger Account",null,"Amount",null,"General Ledger Account",null,"Amount",null,"General Ledger Account",null,"Amount",null,"General Ledger Account",null,"Amount",null,"General Ledger Account",null,"Amount",null,"General Ledger Account",null,"Amount",null,"General Ledger Account",null,"Amount",null,"General Ledger Account",null,"Amount",null,"General Ledger Account",null,"Amount"]
[null,null,"Interest amount"]
[null,null,null,null,null,null,"General Ledger Account",null,"Amount",null,"General Ledger Account",null,"Amount",null,"General Ledger Account",null,"Amount",null,"General Ledger Account",null,"Amount",null,"General Ledger Account",null,"Amount",null,"General Ledger Account",null,"Amount",null,"General Ledger Account",null,"Amount",null,"General Ledger Account",null,"Amount",null,"General Ledger Account",null,"Amount",null,"General Ledger Account",null,"Amount"]
[]
[]
[null,"Note:  Space for ten additional agreements have been provided.  If you need additional space, please contact the CG's Office."]