{"text_format":"1","workbook":"xlsx","n_sheets":9,"sheets":["Contents","Assertions","Foundations","College DCUs in ACFR","Other State DCUs","SONP","SOA","Summary","Order"],"not_rendered":{"charts":0,"images":0,"macros":1,"external_links":2,"defined_names":15,"comments":0,"pivot_tables":0},"unopened":[],"bounds":{"document_bytes":16777216,"sheet_cells":100000,"rows_first":2000,"rows_last":500,"rows_between":2000,"halvings":0,"cell_chars":16384,"cell_head_chars":4096},"cells_cut":0,"cells_raw":0,"read":"whole","date_system":"1900"}

{"sheet":"Contents","index":0,"n_rows":20,"n_cols":4,"rows_kept":20,"cut":false,"hidden":false,"merged":[]}
["STATE OF SOUTH CAROLINA"]
["COLLEGE AND UNIVERSITY FINANCIAL STATEMENT SPREADSHEETS"]
["FISCAL YEAR ENDED JUNE 30, 2024"]
[]
[]
[null,null,null,"WORKSHEET"]
[null,"NAME OF SPREADSHEET",null,"NAME*"]
[]
[null,"Responsibility And Accuracy",null,"Assertions"]
[null,"Please begin with selection of Institution on the Assertions tab."]
[null,"Foundations Analysis (GASB 61)",null,"Foundations"]
[null,"Foundations & Other College and University Component Units Included in State's ACFR",null,"College DCUs in ACFR"]
[null,"Other Discrete Component Units Included in State's ACFR",null,"Other State DCUs"]
[null,"Statement of Net Position",null,"SONP"]
[null,"Statement of Activities",null,"SOA"]
[]
[null,"Throughout the workbook, please enter all amounts in \"whole dollars\" not cents.  "]
[]
["*","To view a schedule, click the appropriate link above or click the appropriate tab at the bottom of the screen."]
[null,"To return to this screen, click the \"Contents\" tab at the bottom of the screen."]

{"sheet":"Assertions","index":1,"n_rows":71,"n_cols":10,"rows_kept":71,"cut":false,"hidden":false,"merged":[[6,0,6,7],[29,5,29,7],[38,5,38,7],[37,4,37,8],[28,4,28,8],[30,4,30,6]]}
[{"$f":"Contents!A1","v":"STATE OF SOUTH CAROLINA"}]
[{"$f":"Contents!A2","v":"COLLEGE AND UNIVERSITY FINANCIAL STATEMENT SPREADSHEETS"}]
["RESPONSIBILITY AND ACCURACY"]
[{"$f":"RIGHT(Contents!$A$3,13)","v":"JUNE 30, 2024"}]
[]
["College/University name:"]
[]
[]
[]
["The information provided in the submission of the Higher Education Excel Spreadsheets is accurate "]
["and complete to the best of our knowledge."]
["Signatures of preparers of financial statement spreadsheets and forms:"]
[]
[null,"Signature",null,null,null,null,null,null,null,"Title"]
["1."]
["2."]
["3."]
["4."]
["5."]
[]
["The information has been reviewed by an individual with an understanding and knowledge of the "]
["requirements and information to be provided.  The forms are complete and accurate to the best of "]
["our knowledge."]
["Reviewer of spreadsheets and forms:"]
[]
[null,null,"Signature:"]
[null,null,"Name and Title:"]
[null,null,null,"Please print or type the Name and Title of the Reviewer"]
[null,"Email Address:"]
[null,"Telephone Number:",null,null,null,null,null,null,"  please include area code."]
{"$rows_left_out":42}
{"sheet":"Foundations","index":2,"n_rows":32,"n_cols":8,"rows_kept":32,"cut":false,"hidden":false,"merged":[[10,0,10,7],[11,0,11,7],[12,4,12,6],[7,0,7,2]]}
[{"$f":"Contents!A1","v":"STATE OF SOUTH CAROLINA"}]
[{"$f":"Contents!A2","v":"COLLEGE AND UNIVERSITY FINANCIAL STATEMENT SPREADSHEETS"}]
["FOUNDATIONS ANALYSIS (GASB No. 61)"]
[{"$f":"RIGHT(Contents!$A$3,13)","v":"JUNE 30, 2024"}]
[null,null,null,null,null,null,"Total Revenues"]
[null,null,null,null,"Total Assets",null,"(all inflows)"]
["College/University name:",null,null,null,{"$f":"IF(E8=0,\"↓ Input ↓\",\"\")","v":"↓ Input ↓"},null,{"$f":"IF(G8=0,\"↓ Input ↓\",\"\")","v":"↓ Input ↓"}]
[{"$f":"Assertions!A7","v":0}]
[]
[]
["Provide financial information on the Statement of Net Position (SONP tab) and the Statement of Activities "]
["(SOA tab) for foundations that equal or exceed 15% of Total Assets or Total Revenues of your primary entity.*"]
[null,null,null,null,"Foundation"]
[null,null,null,null,null,null,"Total"]
[null,null,null,null,null,null,"Revenues"]
[null,null,null,null,"Total Assets",null,"(all inflows)"]
["Enter Foundation Name(s) and Total Assets and Total Revenues (all inflows):",null,null,null,{"$f":"IF(E18=0,\"↓ Input ↓\",\"\")","v":"↓ Input ↓"},null,{"$f":"IF(G18=0,\"↓ Input ↓\",\"\")","v":"↓ Input ↓"}]
["Name of Foundation 1",null,null,null,null,{"$f":"IF(E$8=0,0,E18/E$8)","v":0},null,{"$f":"IF(G$8=0,0,G18/G$8)","v":0}]
["Name of Foundation 2",null,null,null,null,{"$f":"IF(E$8=0,0,E19/E$8)","v":0},null,{"$f":"IF(G$8=0,0,G19/G$8)","v":0}]
["Name of Foundation 3",null,null,null,null,0,null,0]
["Name of Foundation 4",null,null,null,null,0,null,0]
["Name of Foundation 5",null,null,null,null,0,null,0]
[]
[]
[]
[]
["* If a foundation did not meet the 15% threshold in FY 2023 but does exceed the 15% threshold in FY 2024, please contact"]
["David Starkey at (803) 734-2542 or dstarkey@cg.sc.gov to discuss whether the foundation should be included in the"]
["FY 2024 State ACFR.  Likewise, if a foundation met the 15% threshold in FY 2023 but does not meet the threshold in"]
["FY 2024, please contact the CG's Office for further discussion."]
{"$rows_left_out":3}
{"sheet":"College DCUs in ACFR","index":3,"n_rows":87,"n_cols":2,"rows_kept":87,"cut":false,"hidden":false,"merged":[]}
[{"$f":"Contents!A1","v":"STATE OF SOUTH CAROLINA"}]
[{"$f":"Contents!A2","v":"COLLEGE AND UNIVERSITY FINANCIAL STATEMENT SPREADSHEETS"}]
["FOUNDATIONS & OTHER COLLEGE AND UNIVERSITY COMPONENT UNITS INCLUDED IN STATE'S ACFR"]
[{"$f":"\"FOR THE \"&Contents!$A$3","v":"FOR THE FISCAL YEAR ENDED JUNE 30, 2024"}]
[]
[]
["The first column represents the discrete component unit reported in the State's ACFR."]
["The second column lists the entities from the stand-alone financial statements that were included in the State's ACFR as of June 30, 2023."]
["Transactions between the college/university and its entities included in the State's ACFR must be eliminated for purposes of ACFR presentation."]
["Transactions between the entities listed below that are included in the State's ACFR and any entities contained within the stand-alone financial "]
["  statements of your entity but excluded from the State's ACFR should be treated as transactions with external parties."]
[]
[]
["DCU Reported in State's ACFR","Name of Entity in College's Stand-alone Financial Statements"]
[]
["THE CITADEL","The Citadel"]
[null,"The Citadel Trust"]
[null,"The Citadel Foundation"]
[]
["CLEMSON UNIVERSITY","Clemson University"]
[null,"Clemson University Foundation"]
[]
["COASTAL CAROLINA UNIVERSITY","Coastal Carolina University"]
[]
["COLLEGE OF CHARLESTON","College of Charleston"]
[null,"College of Charleston Foundation"]
[]
["FRANCIS MARION UNIVERSITY","Francis Marion University"]
[null,"Francis Marion University Education Foundation"]
[null,"Francis Marion University Development Foundation"]
{"$rows_left_out":58}
{"sheet":"Other State DCUs","index":4,"n_rows":28,"n_cols":2,"rows_kept":28,"cut":false,"hidden":false,"merged":[]}
[{"$f":"Contents!A1","v":"STATE OF SOUTH CAROLINA"}]
[{"$f":"Contents!A2","v":"COLLEGE AND UNIVERSITY FINANCIAL STATEMENT SPREADSHEETS"}]
["OTHER DISCRETE COMPONENT UNITS INCLUDED IN STATE'S ACFR"]
[{"$f":"\"FOR THE \"&Contents!$A$3","v":"FOR THE FISCAL YEAR ENDED JUNE 30, 2024"}]
[]
[]
["Below is a list of all discretely presented component units other than colleges and universities that are reported"]
["in the State's ACFR.  Transactions with these entities should be treated as external transactions."]
[]
["Transactions with any other State agency should be treated as transactions with the primary government."]
["Transactions with the primary government require separate reporting of amounts due from and due to"]
["the primary government on the Statement of Net Position.  However, transactions with the primary government"]
["should be treated as revenues and expenses rather than transfers on the Statement of Activities."]
[]
[]
["Discretely Presented Component Units of the State other than Colleges/Universities:"]
[null,"Public Service Authority"]
[null,"State Ports Authority"]
[null,"Housing Authority"]
[null,"Connector 2000"]
[null,"South Carolina Education Assistance Authority"]
[null,"Jobs-Economic Development Authority"]
[null,"Lottery Commission"]
[null,"Patriots Point Development Authority"]
[null,"South Carolina Medical Malpractice Association"]
[null,"South Carolina First Steps to School Readiness Board of Trustees"]
[null,"Children's Trust Fund of S.C., Inc."]
[null,"South Carolina Research Authority"]

{"sheet":"SONP","index":5,"n_rows":281,"n_cols":9,"rows_kept":281,"cut":false,"hidden":false,"merged":[[6,0,6,2],[7,4,7,7]]}
[{"$f":"Contents!A1","v":"STATE OF SOUTH CAROLINA"}]
[{"$f":"Contents!A2","v":"COLLEGE AND UNIVERSITY FINANCIAL STATEMENT SPREADSHEETS"}]
["STATEMENT OF NET POSITION"]
[{"$f":"RIGHT(Contents!$A$3,13)","v":"JUNE 30, 2024"}]
[]
["College/University name:"]
[{"$f":"Assertions!A7","v":0}]
[null,null,null,null,"Component Units (Foundation, Trust, or Enterprise Campus Authority)"]
[null,null,null,"Primary","# 1","# 2",null,"Reserved for ACFR"]
[null,null,null,"Institution",null,null,"Eliminations","level adjustments","Total"]
[]
[null,"ASSETS"]
[1100000007,null,"Cash & Cash Equivalents",null,null,null,null,null,{"$f":"SUM(D13:H13)","v":0}]
[1200010000,null,"Investments - Current",null,null,null,null,null,{"$f":"SUM(D14:H14)","v":0}]
[1204010000,null,"Investments - Noncurrent",null,null,null,null,null,{"$f":"SUM(D15:H15)","v":0}]
[null,null,"     Total Investments",{"$f":"SUM(D14:D15)","v":0},{"$f":"SUM(E14:E15)","v":0},0,0,0,0]
[null,null,"Receivables - net:"]
[1300030000,null,"  Accounts Receivable (Miscellaneous) - Current",null,null,null,null,null,{"$f":"SUM(D18:H18)","v":0}]
[1300011000,null,"    Allowance for Uncollectible Accounts Receivable - Current",null,null,null,null,null,0]
[1340010000,null,"  Accounts Receivable - Noncurrent",null,null,null,null,null,0]
[1340011000,null,"    Allowance for Uncollectible Accounts Receivable - Noncurrent",null,null,null,null,null,0]
[null,null,"     Total Accounts",{"$f":"SUM(D18:D21)","v":0},{"$f":"SUM(E18:E21)","v":0},0,0,0,0]
[1300040000,null,"  Contributions Receivable - Current",null,null,null,null,null,0]
[1300041000,null,"    Allowance for Uncollectible Contributions Receivable - Current",null,null,null,null,null,0]
[1340040000,null,"  Contributions Receivable - Noncurrent",null,null,null,null,null,0]
[1340041000,null,"    Allowance for Uncollectible Contributions Receivable - Noncurrent",null,null,null,null,null,0]
[null,null,"     Total Contributions",{"$f":"SUM(D23:D26)","v":0},{"$f":"SUM(E23:E26)","v":0},0,0,0,0]
[1300210000,null,"  Accrued Interest Receivable - Current",null,null,null,null,null,0]
[1300150000,null,"  Student Accounts Receivable - Current",null,null,null,null,null,{"$f":"SUM(D29:H29)","v":0}]
[1300151000,null,"    Allowance for Uncollectible Student Accounts Receivable - Current",null,null,null,null,null,0]
{"$rows_left_out":252}
{"sheet":"SOA","index":6,"n_rows":108,"n_cols":9,"rows_kept":108,"cut":false,"hidden":false,"merged":[[7,4,7,7],[6,0,6,2]]}
[{"$f":"Contents!A1","v":"STATE OF SOUTH CAROLINA"}]
[{"$f":"Contents!A2","v":"COLLEGE AND UNIVERSITY FINANCIAL STATEMENT SPREADSHEETS"}]
["STATEMENT OF ACTIVITIES"]
[{"$f":"\"FOR THE \"&Contents!$A$3","v":"FOR THE FISCAL YEAR ENDED JUNE 30, 2024"}]
[]
["College/University name:"]
[{"$f":"Assertions!A7","v":0}]
[null,null,null,null,"Component Units (Foundation, Trust, or Enterprise Campus Authority)"]
[null,null,null,"Primary","# 1","# 2",null,"Reserved for ACFR"]
[null,null,null,"Institution",null,null,"Eliminations","level adjustments","Total"]
[]
[null,"Expenses:"]
[null,null,"Operating expenses",null,null,null,null,null,{"$f":"SUM(D13:H13)","v":0}]
[null,null,"Nonoperating interest expense",null,null,null,null,null,0]
[null,null,"Loss on disposal of capital assets",null,null,null,null,null,0]
[null,null,"Other nonoperating expenses",null,null,null,null,null,0]
[null,null,"Transfers out to other state agencies",null,null,null,null,null,0]
[5500003000,null,"     Total expenses",{"$f":"SUM(D13:D17)","v":0},{"$f":"SUM(E13:E17)","v":0},{"$f":"SUM(F13:F17)","v":0},{"$f":"SUM(G13:G17)","v":0},{"$f":"SUM(H13:H17)","v":0},0]
[]
[null,"Charges for Services, net:"]
[null,null,"Student Tuition and Fees",null,null,null,null,null,{"$f":"SUM(D21:H21)","v":0}]
[null,null,"Sales and Services of Auxiliary Enterprises",null,null,null,null,null,0]
[null,null,"Sales and Services of Educational Activities",null,null,null,null,null,0]
[null,null,"Sales and Services of Foundations",null,null,null,null,null,0]
[null,null,"Federal Operating Grants and Contracts",null,null,null,null,null,0]
[null,null,"State Operating Grants and Contracts",null,null,null,null,null,0]
[null,null,"Local/Private Operating Grants and Contracts",null,null,null,null,null,0]
[null,null,"Rental and lease income",null,null,null,null,null,0]
[null,null,"Other charges for services",null,null,null,null,null,0]
[4500000195,null,"     Total charges for services",{"$f":"SUM(D21:D29)","v":0},{"$f":"SUM(E21:E29)","v":0},{"$f":"SUM(F21:F29)","v":0},{"$f":"SUM(G21:G29)","v":0},{"$f":"SUM(H21:H29)","v":0},0]
{"$rows_left_out":79}
{"sheet":"Summary","index":7,"n_rows":2677,"n_cols":7,"rows_kept":2677,"cut":false,"hidden":true,"merged":[]}
["Worksheet","Agnecy Code","Agency Name","Year","QUESTION","Unit","Answers"]
["A-Position",{"$f":"IF(LEFT(Assertions!#REF!,3)=\"\",\"\",LEFT(Assertions!#REF!,3))","v":{"$error":"#REF!"}},{"$f":"IF(AgencyCode=\"\",\"\",VLOOKUP(AgencyCode,Assertions!A46:B71,2,FALSE))","v":{"$error":"#REF!"}},{"$f":"IF(AgencyCode=\"\",\"\",RIGHT(Assertions!A4,4))","v":{"$error":"#REF!"}},"1100000000:Current Assets::Cash & Cash Equivalents","Primary Institution",{"$f":"IF(#REF!=\"\",\"\",#REF!)","v":{"$error":"#REF!"}}]
["A-Position",{"$f":"IF(AgencyCode=\"\",\"\",AgencyCode)","v":{"$error":"#REF!"}},{"$f":"IF(AgencyName=\"\",\"\",AgencyName)","v":{"$error":"#REF!"}},{"$f":"IF(Year=\"\",\"\",Year)","v":{"$error":"#REF!"}},"1200010000:Current Assets::Investments - Short-term","Primary Institution",{"$f":"IF(#REF!=\"\",\"\",#REF!)","v":{"$error":"#REF!"}}]
["A-Position",{"$error":"#REF!"},{"$error":"#REF!"},{"$error":"#REF!"},"1300150000:Current Assets::Student Accounts Receivable","Primary Institution",{"$f":"IF(#REF!=\"\",\"\",#REF!)","v":{"$error":"#REF!"}}]
["A-Position",{"$error":"#REF!"},{"$error":"#REF!"},{"$error":"#REF!"},"1300151000:Current Assets::Allowance for Uncollectible Student Accounts Receivable","Primary Institution",{"$f":"IF(#REF!=\"\",\"\",#REF!)","v":{"$error":"#REF!"}}]
["A-Position",{"$error":"#REF!"},{"$error":"#REF!"},{"$error":"#REF!"},"1300160000:Current Assets::Patient Accounts Receivable","Primary Institution",{"$f":"IF(#REF!=\"\",\"\",#REF!)","v":{"$error":"#REF!"}}]
["A-Position",{"$error":"#REF!"},{"$error":"#REF!"},{"$error":"#REF!"},"1300161000:Current Assets::Allowance for Uncollectible Patient Accounts Receivable","Primary Institution",{"$f":"IF(#REF!=\"\",\"\",#REF!)","v":{"$error":"#REF!"}}]
["A-Position",{"$error":"#REF!"},{"$error":"#REF!"},{"$error":"#REF!"},"1300230000:Current Assets::Allowance for Contractual Adjustments","Primary Institution",{"$f":"IF(#REF!=\"\",\"\",#REF!)","v":{"$error":"#REF!"}}]
["A-Position",{"$error":"#REF!"},{"$error":"#REF!"},{"$error":"#REF!"},"1300030000:Current Assets::Accounts Receivable (Miscellaneous)","Primary Institution",{"$f":"IF(#REF!=\"\",\"\",#REF!)","v":{"$error":"#REF!"}}]
["A-Position",{"$error":"#REF!"},{"$error":"#REF!"},{"$error":"#REF!"},"1300011000:Current Assets::Allowance for Uncollectible Accounts Receivable","Primary Institution",{"$f":"IF(#REF!=\"\",\"\",#REF!)","v":{"$error":"#REF!"}}]
["A-Position",{"$error":"#REF!"},{"$error":"#REF!"},{"$error":"#REF!"},"1300040000:Current Assets::Contributions Receivable ","Primary Institution",{"$f":"IF(#REF!=\"\",\"\",#REF!)","v":{"$error":"#REF!"}}]
["A-Position",{"$error":"#REF!"},{"$error":"#REF!"},{"$error":"#REF!"},"1300041000:Current Assets::Allowance for Uncollectible Contributions Receivable","Primary Institution",{"$f":"IF(#REF!=\"\",\"\",#REF!)","v":{"$error":"#REF!"}}]
["A-Position",{"$error":"#REF!"},{"$error":"#REF!"},{"$error":"#REF!"},"1310000000:Current Assets::Loans and Notes Receivable ","Primary Institution",{"$f":"IF(#REF!=\"\",\"\",#REF!)","v":{"$error":"#REF!"}}]
["A-Position",{"$error":"#REF!"},{"$error":"#REF!"},{"$error":"#REF!"},"1311000000:Current Assets::Allowance for Uncollectible Loans and Notes Receivable","Primary Institution",{"$f":"IF(#REF!=\"\",\"\",#REF!)","v":{"$error":"#REF!"}}]
["A-Position",{"$error":"#REF!"},{"$error":"#REF!"},{"$error":"#REF!"},"1320000000:Current Assets::Student Loan Receivable ","Primary Institution",{"$f":"IF(#REF!=\"\",\"\",#REF!)","v":{"$error":"#REF!"}}]
["A-Position",{"$error":"#REF!"},{"$error":"#REF!"},{"$error":"#REF!"},"1321000000:Current Assets::Allowance for Uncollectible Student Loan Receivable","Primary Institution",{"$f":"IF(#REF!=\"\",\"\",#REF!)","v":{"$error":"#REF!"}}]
["A-Position",{"$error":"#REF!"},{"$error":"#REF!"},{"$error":"#REF!"},"1300210000:Current Assets::Accrued Interest Receivable on Investments","Primary Institution",{"$f":"IF(#REF!=\"\",\"\",#REF!)","v":{"$error":"#REF!"}}]
["A-Position",{"$error":"#REF!"},{"$error":"#REF!"},{"$error":"#REF!"},"1331000000:Current Assets::Due From Federal Government","Primary Institution",{"$f":"IF(#REF!=\"\",\"\",#REF!)","v":{"$error":"#REF!"}}]
["A-Position",{"$error":"#REF!"},{"$error":"#REF!"},{"$error":"#REF!"},"1332000000:Current Assets::Due From Grantors (Other)","Primary Institution",{"$f":"IF(#REF!=\"\",\"\",#REF!)","v":{"$error":"#REF!"}}]
["A-Position",{"$error":"#REF!"},{"$error":"#REF!"},{"$error":"#REF!"},"1390040000:Current Assets::Due from other state agencies","Primary Institution",{"$f":"IF(#REF!=\"\",\"\",#REF!)","v":{"$error":"#REF!"}}]
["A-Position",{"$error":"#REF!"},{"$error":"#REF!"},{"$error":"#REF!"},"1390030000:Current Assets::Due from primary government","Primary Institution",{"$f":"IF(#REF!=\"\",\"\",#REF!)","v":{"$error":"#REF!"}}]
["A-Position",{"$error":"#REF!"},{"$error":"#REF!"},{"$error":"#REF!"},"1390020000:Current Assets::Due from component units","Primary Institution",{"$f":"IF(#REF!=\"\",\"\",#REF!)","v":{"$error":"#REF!"}}]
["A-Position",{"$error":"#REF!"},{"$error":"#REF!"},{"$error":"#REF!"},":Current Assets::Due from other funds within these stand-alone financial stmts.","Primary Institution",{"$f":"IF(#REF!=\"\",\"\",#REF!)","v":{"$error":"#REF!"}}]
["A-Position",{"$error":"#REF!"},{"$error":"#REF!"},{"$error":"#REF!"},":Current Assets::Due from state agencies (primary government)","Primary Institution",{"$f":"IF(#REF!=\"\",\"\",#REF!)","v":{"$error":"#REF!"}}]
["A-Position",{"$error":"#REF!"},{"$error":"#REF!"},{"$error":"#REF!"},":Current Assets::Due from State of SC component units","Primary Institution",{"$f":"IF(#REF!=\"\",\"\",#REF!)","v":{"$error":"#REF!"}}]
["A-Position",{"$error":"#REF!"},{"$error":"#REF!"},{"$error":"#REF!"},"1400030000:Current Assets::Inventories","Primary Institution",{"$f":"IF(#REF!=\"\",\"\",#REF!)","v":{"$error":"#REF!"}}]
["A-Position",{"$error":"#REF!"},{"$error":"#REF!"},{"$error":"#REF!"},"1600110000:Current Assets::Prepaid Items - Current","Primary Institution",{"$f":"IF(#REF!=\"\",\"\",#REF!)","v":{"$error":"#REF!"}}]
["A-Position",{"$error":"#REF!"},{"$error":"#REF!"},{"$error":"#REF!"},"1500010000:Current Assets::Cash & Cash Equivalents ","Primary Institution",{"$f":"IF(#REF!=\"\",\"\",#REF!)","v":{"$error":"#REF!"}}]
["A-Position",{"$error":"#REF!"},{"$error":"#REF!"},{"$error":"#REF!"},"1500020000:Current Assets::Investments ","Primary Institution",{"$f":"IF(#REF!=\"\",\"\",#REF!)","v":{"$error":"#REF!"}}]
["A-Position",{"$error":"#REF!"},{"$error":"#REF!"},{"$error":"#REF!"},"1500040000:Current Assets::Student Loans Receivable ","Primary Institution",{"$f":"IF(#REF!=\"\",\"\",#REF!)","v":{"$error":"#REF!"}}]
{"$rows_left_out":2648}
{"sheet":"Order","index":8,"n_rows":556,"n_cols":8,"rows_kept":556,"cut":false,"hidden":true,"merged":[]}
[]
["A Position"]
[]
[null,null,"ASSETS"]
[]
[null,null,"Current Assets:"]
[1,1100000000,"Current Assets:","Cash & Cash Equivalents"]
[2,1200010000,"Current Assets:","Investments - Short-term"]
[3,null,"Current Assets:","Receivables - Current (net):"]
[4,1300150000,"Current Assets:","Student Accounts Receivable"]
[5,1300151000,"Current Assets:","Allowance for Uncollectible Student Accounts Receivable"]
[6,1300160000,"Current Assets:","Patient Accounts Receivable"]
[7,1300161000,"Current Assets:","Allowance for Uncollectible Patient Accounts Receivable"]
[8,1300230000,"Current Assets:","Allowance for Contractual Adjustments"]
[9,1300030000,"Current Assets:","Accounts Receivable (Miscellaneous)"]
[10,1300011000,"Current Assets:","Allowance for Uncollectible Accounts Receivable"]
[11,1300040000,"Current Assets:","Contributions Receivable "]
[12,1300041000,"Current Assets:","Allowance for Uncollectible Contributions Receivable"]
[13,1310000000,"Current Assets:","Loans and Notes Receivable "]
[14,1311000000,"Current Assets:","Allowance for Uncollectible Loans and Notes Receivable"]
[15,1320000000,"Current Assets:","Student Loan Receivable "]
[16,1321000000,"Current Assets:","Allowance for Uncollectible Student Loan Receivable"]
[17,1300210000,"Current Assets:","Accrued Interest Receivable on Investments"]
[18,1331000000,"Current Assets:","Due From Federal Government"]
[19,1332000000,"Current Assets:","Due From Grantors (Other)"]
[20,1390040000,"Current Assets:","Due from other state agencies"]
[21,1390030000,"Current Assets:","Due from primary government"]
[22,1390020000,"Current Assets:","Due from component units"]
[23,null,"Current Assets:","Due from other funds within these stand-alone financial stmts."]
[24,null,"Current Assets:","Due from state agencies (primary government)"]
{"$rows_left_out":526}