{"text_format":"1","workbook":"xlsx","n_sheets":10,"sheets":["Revisions","Yearly Data","Master Listing","Instructions","Signature Page","3.01.1 Petty Cash","3.01.2 Cash-Bank","3.01.2 Cash-Bank (New)","3.01.3 Investments","3.01.4 Reviewer's Checklist"],"not_rendered":{"charts":0,"images":1,"macros":1,"external_links":0,"defined_names":11,"comments":0,"pivot_tables":0},"unopened":[],"bounds":{"document_bytes":16777216,"sheet_cells":100000,"rows_first":2000,"rows_last":500,"rows_between":2000,"halvings":0,"cell_chars":16384,"cell_head_chars":4096},"cells_cut":0,"cells_raw":0,"read":"whole","date_system":"1900"}

{"sheet":"Revisions","index":0,"n_rows":19,"n_cols":4,"rows_kept":19,"cut":false,"hidden":true,"merged":[]}
[]
["Change","Question","Description"]
[1,"All","Changed the question numbering to simplify",2016]
[2,null,"Updated agency changes",2016]
[3,null,"Added the certification statement to the bottom of the signature page",2016]
[4,null,"Updated instructions",2016]
[5,null,"Updated Signature Page",2016]
[6,null,"Add fair value information to 3.01.3",2016]
[7,null,"Updated Summary tab",2016]
[8,null,"Changed year on Signature Page"]
{"$rows_left_out":10}
{"sheet":"Yearly Data","index":1,"n_rows":89,"n_cols":3,"rows_kept":89,"cut":false,"hidden":true,"merged":[]}
["Year",2024]
[]
[]
["The following information must be reviewed and updated as necessary anually:"]
[]
["AGCY  CODE","AGENCY NAME","FY Added"]
["Select Agency Code","Please Select Agency Code on Signature Page Tab"]
["A010","LEGISLATIVE DEPARTMENT - THE SENATE"]
["A050","LEGISLATIVE DEPARTMENT - HOUSE OF REPRESENTATIVES"]
["A150","LEGISLATIVE DEPARTMENT - CODIFICATION OF LAWS & LEGISLATIVE COUNCIL"]
{"$rows_left_out":80}
{"sheet":"Master Listing","index":2,"n_rows":355,"n_cols":17,"rows_kept":355,"cut":false,"hidden":true,"merged":[]}
["Order","Agency","Bank Name","Bank Acct No","Bank Account Name","Nature of Bank Account?","In SCEIS?","SCEIS GL No","Fund","grouping","Fiduciary/Governmental?","GAAP Fund","Order","Helper 1","Helper 2","Helper 3","x"]
[1,"B040","TD Bank","xxxxxx-01751","Comm Counsel","Fiduciary","No","N/A","N/A","C",null,null,null,{"$f":"ROWS($A$2:M2)","v":1},{"$f":"IF(ISNUMBER(SEARCH(AgencyCode,$B2)),N2,\"\")","v":""},{"$f":"IFERROR(SMALL($O$2:$O$1534,ROWS($O$2:O2)),\"\")","v":9},{"$f":"CONCATENATE(B2,I2,H2)","v":"B040N/AN/A"}]
[2,"B040","Bank of America","xxxxxx-41264","Supreme Court","Operational","No","N/A","N/A","C",null,null,null,{"$f":"ROWS($A$2:M3)","v":2},"",{"$f":"IFERROR(SMALL($O$2:$O$1534,ROWS($O$2:O3)),\"\")","v":""},"B040N/AN/A"]
[3,"D100","Wells Fargo","xxxxxx-29419","Discretionary","Operational","No","N/A","N/A","C",null,null,null,{"$f":"ROWS($A$2:M4)","v":3},"",{"$f":"IFERROR(SMALL($O$2:$O$1534,ROWS($O$2:O4)),\"\")","v":""},"D100N/AN/A"]
[4,"D100","Wells Fargo","xxxxxx-90805","SC Midlan Hidta","Operational","No","N/A","N/A","C",null,null,null,{"$f":"ROWS($A$2:M5)","v":4},"",{"$f":"IFERROR(SMALL($O$2:$O$1534,ROWS($O$2:O5)),\"\")","v":""},"D100N/AN/A"]
[5,"D200","Wells Fargo","xxxxxx-28627","Gov Mansion","Operational","No","N/A","N/A","C",null,null,null,{"$f":"ROWS($A$2:M6)","v":5},"",{"$f":"IFERROR(SMALL($O$2:$O$1534,ROWS($O$2:O6)),\"\")","v":""},"D200N/AN/A"]
[6,"D500","Wells Fargo","xxxxxx-13236","Network Composite Account","Operational","No","N/A","N/A","B",null,null,null,{"$f":"ROWS($A$2:M7)","v":6},"",{"$f":"IFERROR(SMALL($O$2:$O$1534,ROWS($O$2:O7)),\"\")","v":""},"D500N/AN/A"]
[7,"E080",null,null,"Petty Cash","Operational","No","N/A",30350000,"B","1.A General Funds",1,null,{"$f":"ROWS($A$2:M8)","v":7},"",{"$f":"IFERROR(SMALL($O$2:$O$1534,ROWS($O$2:O8)),\"\")","v":""},"E08030350000N/A"]
[8,"E080","Wells Fargo","xxxxxx-29325","STO Composite Reservoir Return Check","Operational","Yes",4530010000,30350000,"C",null,null,null,{"$f":"ROWS($A$2:M9)","v":8},"",{"$f":"IFERROR(SMALL($O$2:$O$1534,ROWS($O$2:O9)),\"\")","v":""},"E080303500004530010000"]
[9,"E120","Synovus","xxxxxx-86901","Comptroller General Employee",{"$f":"IF(LEFT(K10,1)=\"3\",\"Fiduciary\",IF(OR(LEFT(K10,\"1\")=1,LEFT(K10,1)=\"2\"),\"Operational\",\"\"))","v":"Fiduciary"},"No","N/A","N/A","B","3.D Custodial Trust Funds",254,null,{"$f":"ROWS($A$2:M10)","v":9},9,{"$f":"IFERROR(SMALL($O$2:$O$1534,ROWS($O$2:O10)),\"\")","v":""},"E120N/AN/A"]
{"$rows_left_out":346}
{"sheet":"Instructions","index":3,"n_rows":82,"n_cols":13,"rows_kept":82,"cut":false,"hidden":false,"merged":[]}
["STATE OF SOUTH CAROLINA"]
["YEAR-END REPORTING PROCEDURES MANUAL"]
["SECTION 3.01, CASH AND INVESTMENTS REPORTING PACKAGE"]
[null,"Due Date",null,"2024-07-19"]
[null,"PURPOSE and OBJECTIVE:"]
[null,"The amount of cash and investments reported in the financial statements of the State is an important "]
[null,"measure of the State's financial soundness.  This reporting package is designed to gather"]
[null,"information regarding the types of cash and investments owned by the agencies essential for "]
[null,"accurate and complete reporting."]
[]
{"$rows_left_out":73}
{"sheet":"Signature Page","index":4,"n_rows":48,"n_cols":6,"rows_kept":48,"cut":false,"hidden":false,"merged":[[47,1,47,5],[33,3,33,4],[39,1,39,5],[41,1,41,5],[43,1,43,5],[45,1,45,5]]}
[null,null,"CASH AND INVESTMENTS REPORTING PACKAGE SIGNATURE PAGE"]
[]
[null,null,"DUE DATE",null,{"$f":"CONCATENATE(TEXT(duedate,\"DDDD\"),\", \",TEXT(duedate,\"M/D/YYYY\"))","v":"Friday, 7/19/2024"}]
[null,null,"CAFR Reporting Period:",null,{"$f":"TEXT(duedate,\"YYYY\")","v":"2024"}]
[null,null,"Agency Number:",null,"E120","*"]
[null,null,"Agency Name",null,{"$f":"IF(ISERROR(VLOOKUP(AgencyCode,'Yearly Data'!A7:B89,2,FALSE))=TRUE,\"\",VLOOKUP(AgencyCode,'Yearly Data'!A7:B89,2,FALSE))","v":"COMPTROLLER GENERAL'S OFFICE\n"}]
[]
[]
[]
[null,null,null,null,"Before completing this package, please answer the following questions."]
{"$rows_left_out":39}
{"sheet":"3.01.1 Petty Cash","index":5,"n_rows":184,"n_cols":5,"rows_kept":184,"cut":false,"hidden":false,"merged":[[0,0,0,4],[1,0,1,4],[2,0,2,4],[60,0,62,2],[23,1,23,3],[19,1,19,3],[9,1,9,3],[17,1,17,3],[21,1,21,3],[5,2,5,4],[6,2,6,4],[11,1,15,3]]}
["STATE OF SOUTH CAROLINA"]
["CASH ON HAND/PETTY CASH REPORTING FORM"]
[{"$f":"IF(Year=\"\",\"At June 30, \",\"At June 30, \"&Year)","v":"At June 30, 2024"}]
[]
[]
["Agency:",{"$f":"IF(AgencyCode=\"\",\"\",AgencyCode)","v":"E120"},{"$f":"IF(AgencyName=\"\",\"Please choose your agency number on the Signature Page form.\",AgencyName)","v":"COMPTROLLER GENERAL'S OFFICE\n"}]
[null,"Business Area","Name"]
[]
[]
["1.","Was any portion of your authorized cash on hand/petty cash relinquished or surrendered during the year?",null,null,"No"]
{"$rows_left_out":175}
{"sheet":"3.01.2 Cash-Bank","index":6,"n_rows":218,"n_cols":16,"rows_kept":218,"cut":false,"hidden":false,"merged":[]}
[{"$f":"CONCATENATE(\"STATE OF SOUTH CAROLINA\",\" - \",AgencyCode,\" \",AgencyName)","v":"STATE OF SOUTH CAROLINA - E120 COMPTROLLER GENERAL'S OFFICE\n"}]
["DEPOSITS WITH BANKS REPORTING FORM-Prepopulated"]
[{"$f":"IF(Year=\"\",\"At June 30, \",\"At June 30, \"&Year)","v":"At June 30, 2024"}]
["Below are Bank Accounts reported by your Agency in previous FY cash reporting package OR reported to the CG by the State Treasurer's Office as bank accounts held by your Agency."]
[null,"Please Correct/Delete Pre-Populated Information If Necessary",null,null,"Please Indicate:",null,null,null,null,null,null,null,"Required Supplemental Information and Written Explanation(s) to be Submitted with Closing Package:"]
["Agency ","Bank Name","Bank Account #","Bank Account Name","Nature of Bank Account?","Recorded In SCEIS?","SCEIS G/L #","Fund #","Has Account been closed?","Balance per SCEIS","Reconciled Balance","Bank Statement Balance","Year-End Bank Statement Required?","Year-End Reconciliation Required?","Explanation Required in Adjacent Cell","Your Agency's Written Explanation"]
[{"$f":"IFERROR(INDEX('Master Listing'!$B$2:$M$355,'Master Listing'!$P2,COLUMNS('3.01.2 Cash-Bank'!$A$6:A6)),\"\")","v":"E120"},{"$f":"IFERROR(INDEX('Master Listing'!$B$2:$M$355,'Master Listing'!$P2,COLUMNS('3.01.2 Cash-Bank'!$A$6:B6)),\"\")","v":"Synovus"},{"$f":"IFERROR(INDEX('Master Listing'!$B$2:$M$355,'Master Listing'!$P2,COLUMNS('3.01.2 Cash-Bank'!$A$6:C6)),\"\")","v":"xxxxxx-86901"},{"$f":"IFERROR(INDEX('Master Listing'!$B$2:$M$355,'Master Listing'!$P2,COLUMNS('3.01.2 Cash-Bank'!$A$6:D6)),\"\")","v":"Comptroller General Employee"},{"$f":"IFERROR(INDEX('Master Listing'!$B$2:$M$355,'Master Listing'!$P2,COLUMNS('3.01.2 Cash-Bank'!$A$6:E6)),\"\")","v":"Fiduciary"},{"$f":"IFERROR(INDEX('Master Listing'!$B$2:$M$355,'Master Listing'!$P2,COLUMNS('3.01.2 Cash-Bank'!$A$6:F6)),\"\")","v":"No"},{"$f":"IFERROR(INDEX('Master Listing'!$B$2:$M$355,'Master Listing'!$P2,COLUMNS('3.01.2 Cash-Bank'!$A$6:G6)),\"\")","v":"N/A"},{"$f":"IFERROR(INDEX('Master Listing'!$B$2:$M$355,'Master Listing'!$P2,COLUMNS('3.01.2 Cash-Bank'!$A$6:H6)),\"\")","v":"N/A"},"No",0,150,125,{"$f":"IF($F7=\"No\",\"Required\",IF($J7<>$K7,\"Required\",\"\"))","v":"Required"},{"$f":"IF($F7=\"No\",\"Required\",IF($J7<>$K7,\"Required\",\"\"))","v":"Required"},{"$f":"IF(B7=\"\",\"\",IF(F7=\"No\",\"* EXPLAIN: why this account is not in SCEIS\",CONCATENATE(IF(J7<>K7,\"* EXPLAIN: why was the SCEIS balance not adjusted to the reconciled balance?\",\"\"),IF(H7=\"\",\"  * EXPLAIN: activity in this account and how this activity is reflected in SCEIS\",\"\"))))","v":"* EXPLAIN: why this account is not in SCEIS"},"Legislative approval to keep bank balance activity off SCEIS"]
[{"$f":"IFERROR(INDEX('Master Listing'!$B$2:$M$355,'Master Listing'!$P3,COLUMNS('3.01.2 Cash-Bank'!$A$6:A7)),\"\")","v":""},{"$f":"IFERROR(INDEX('Master Listing'!$B$2:$M$355,'Master Listing'!$P3,COLUMNS('3.01.2 Cash-Bank'!$A$6:B7)),\"\")","v":""},{"$f":"IFERROR(INDEX('Master Listing'!$B$2:$M$355,'Master Listing'!$P3,COLUMNS('3.01.2 Cash-Bank'!$A$6:C7)),\"\")","v":""},{"$f":"IFERROR(INDEX('Master Listing'!$B$2:$M$355,'Master Listing'!$P3,COLUMNS('3.01.2 Cash-Bank'!$A$6:D7)),\"\")","v":""},{"$f":"IFERROR(INDEX('Master Listing'!$B$2:$M$355,'Master Listing'!$P3,COLUMNS('3.01.2 Cash-Bank'!$A$6:E7)),\"\")","v":""},{"$f":"IFERROR(INDEX('Master Listing'!$B$2:$M$355,'Master Listing'!$P3,COLUMNS('3.01.2 Cash-Bank'!$A$6:F7)),\"\")","v":""},{"$f":"IFERROR(INDEX('Master Listing'!$B$2:$M$355,'Master Listing'!$P3,COLUMNS('3.01.2 Cash-Bank'!$A$6:G7)),\"\")","v":""},{"$f":"IFERROR(INDEX('Master Listing'!$B$2:$M$355,'Master Listing'!$P3,COLUMNS('3.01.2 Cash-Bank'!$A$6:H7)),\"\")","v":""},null,null,null,null,{"$f":"IF($F8=\"No\",\"Required\",IF($J8<>$K8,\"Required\",\"\"))","v":""},"",{"$f":"IF(B8=\"\",\"\",IF(F8=\"No\",\"* EXPLAIN: why this account is not in SCEIS\",CONCATENATE(IF(J8<>K8,\"* EXPLAIN: why was the SCEIS balance not adjusted to the reconciled balance?\",\"\"),IF(H8=\"\",\"  * EXPLAIN: activity in this account and how this activity is reflected in SCEIS\",\"\"))))","v":""}]
[{"$f":"IFERROR(INDEX('Master Listing'!$B$2:$M$355,'Master Listing'!$P4,COLUMNS('3.01.2 Cash-Bank'!$A$6:A8)),\"\")","v":""},{"$f":"IFERROR(INDEX('Master Listing'!$B$2:$M$355,'Master Listing'!$P4,COLUMNS('3.01.2 Cash-Bank'!$A$6:B8)),\"\")","v":""},{"$f":"IFERROR(INDEX('Master Listing'!$B$2:$M$355,'Master Listing'!$P4,COLUMNS('3.01.2 Cash-Bank'!$A$6:C8)),\"\")","v":""},{"$f":"IFERROR(INDEX('Master Listing'!$B$2:$M$355,'Master Listing'!$P4,COLUMNS('3.01.2 Cash-Bank'!$A$6:D8)),\"\")","v":""},{"$f":"IFERROR(INDEX('Master Listing'!$B$2:$M$355,'Master Listing'!$P4,COLUMNS('3.01.2 Cash-Bank'!$A$6:E8)),\"\")","v":""},{"$f":"IFERROR(INDEX('Master Listing'!$B$2:$M$355,'Master Listing'!$P4,COLUMNS('3.01.2 Cash-Bank'!$A$6:F8)),\"\")","v":""},{"$f":"IFERROR(INDEX('Master Listing'!$B$2:$M$355,'Master Listing'!$P4,COLUMNS('3.01.2 Cash-Bank'!$A$6:G8)),\"\")","v":""},{"$f":"IFERROR(INDEX('Master Listing'!$B$2:$M$355,'Master Listing'!$P4,COLUMNS('3.01.2 Cash-Bank'!$A$6:H8)),\"\")","v":""},null,null,null,null,"","",""]
[{"$f":"IFERROR(INDEX('Master Listing'!$B$2:$M$355,'Master Listing'!$P5,COLUMNS('3.01.2 Cash-Bank'!$A$6:A9)),\"\")","v":""},{"$f":"IFERROR(INDEX('Master Listing'!$B$2:$M$355,'Master Listing'!$P5,COLUMNS('3.01.2 Cash-Bank'!$A$6:B9)),\"\")","v":""},{"$f":"IFERROR(INDEX('Master Listing'!$B$2:$M$355,'Master Listing'!$P5,COLUMNS('3.01.2 Cash-Bank'!$A$6:C9)),\"\")","v":""},{"$f":"IFERROR(INDEX('Master Listing'!$B$2:$M$355,'Master Listing'!$P5,COLUMNS('3.01.2 Cash-Bank'!$A$6:D9)),\"\")","v":""},{"$f":"IFERROR(INDEX('Master Listing'!$B$2:$M$355,'Master Listing'!$P5,COLUMNS('3.01.2 Cash-Bank'!$A$6:E9)),\"\")","v":""},{"$f":"IFERROR(INDEX('Master Listing'!$B$2:$M$355,'Master Listing'!$P5,COLUMNS('3.01.2 Cash-Bank'!$A$6:F9)),\"\")","v":""},{"$f":"IFERROR(INDEX('Master Listing'!$B$2:$M$355,'Master Listing'!$P5,COLUMNS('3.01.2 Cash-Bank'!$A$6:G9)),\"\")","v":""},{"$f":"IFERROR(INDEX('Master Listing'!$B$2:$M$355,'Master Listing'!$P5,COLUMNS('3.01.2 Cash-Bank'!$A$6:H9)),\"\")","v":""},null,null,null,null,"","",""]
{"$rows_left_out":209}
{"sheet":"3.01.2 Cash-Bank (New)","index":7,"n_rows":217,"n_cols":16,"rows_kept":217,"cut":false,"hidden":false,"merged":[]}
[{"$f":"CONCATENATE(\"STATE OF SOUTH CAROLINA\",\" - \",AgencyCode,\" \",AgencyName)","v":"STATE OF SOUTH CAROLINA - E120 COMPTROLLER GENERAL'S OFFICE\n"}]
["DEPOSITS WITH BANKS REPORTING FORM"]
[{"$f":"IF(Year=\"\",\"At June 30, \",\"At June 30, \"&Year)","v":"At June 30, 2024"}]
["Below are Bank Accounts that are not listed on form 3.01.2.  "]
[null,"Please Correct/Delete Pre-Populated Information If Necessary",null,null,"Please Indicate:",null,null,null,null,null,null,null,"Required Supplemental Information and Written Explanation(s) to be Submitted with Closing Package:"]
["Agency ","Bank Name","Bank Account #","Bank Account Name","Nature of Bank Account?","Recorded In SCEIS?","SCEIS G/L #","Fund #","Has Account been closed?","Balance per SCEIS","Reconciled Balance","Bank Statement Balance","Year-End Bank Statement Required?","Year-End Reconciliation Required?","Explanation Required in Adjacent Cell","Your Agency's Written Explanation"]
[null,null,null,null,null,null,null,null,null,null,null,null,{"$f":"IF($F7=\"No\",\"Required\",IF($J7<>$K7,\"Required\",\"\"))","v":""},{"$f":"IF($F7=\"No\",\"Required\",IF($J7<>$K7,\"Required\",\"\"))","v":""},{"$f":"IF(B7=\"\",\"\",IF(F7=\"No\",\"* EXPLAIN: why this account is not in SCEIS\",CONCATENATE(IF(J7<>K7,\"* EXPLAIN: why was the SCEIS balance not adjusted to the reconciled balance?\",\"\"),IF(H7=\"\",\"  * EXPLAIN: activity in this account and how this activity is reflected in SCEIS\",\"\"))))","v":""}]
[{"$f":"IF(B8<>\"\",AgencyCode,\"\")","v":""},null,null,null,null,null,null,null,null,null,null,null,{"$f":"IF($G8=\"No\",\"Required\",IF($J8<>$K8,\"Required\",\"\"))","v":""},"",{"$f":"IF(B8=\"\",\"\",IF(G8=\"No\",\"* EXPLAIN: why this account is not in SCEIS\",CONCATENATE(IF(J8<>K8,\"* EXPLAIN: why was the SCEIS balance not adjusted to the reconciled balance?\",\"\"),IF(I8=\"\",\"  * EXPLAIN: activity in this account and how this activity is reflected in SCEIS\",\"\"))))","v":""},{"$f":"IF(O8=\"\",\"\",IF(O8<>\"No explanation required\",\"Please enter required explanation(s) here\",\"\"))","v":""}]
["",null,null,null,null,null,null,null,null,null,null,null,"","","",""]
["",null,null,null,null,null,null,null,null,null,null,null,"","","",""]
{"$rows_left_out":208}
{"sheet":"3.01.3 Investments","index":8,"n_rows":56,"n_cols":14,"rows_kept":56,"cut":false,"hidden":false,"merged":[[4,7,5,9],[0,0,0,6]]}
[{"$f":"CONCATENATE(\"STATE OF SOUTH CAROLINA\",\" - \",AgencyCode,\" \",AgencyName)","v":"STATE OF SOUTH CAROLINA - E120 COMPTROLLER GENERAL'S OFFICE\n"}]
["INVESTMENTS IN MARKETABLE SECURITIES REPORTING FORM"]
[{"$f":"IF(Year=\"\",\"At June 30, \",\"At June 30, \"&Year)","v":"At June 30, 2024"}]
[]
[1,"Does the report provided by the Comptroller General's Office properly ",null,null,null,null,null,{"$f":"IF(G6=\"\",\"\",IF(G6=\"No\",\"Provide below appropriate offset for recording difference.\",\"\"))","v":""}]
[null,"reflect the balance(s) for investments owned (at fair value)?"]
[]
[2,"Please provide the following, if additional space is required, an attachment may be submitted in lieu (please indicate See Attached in the Asset Name field)."]
["Agency","CUSIP/Ticker","Asset Name"," Type of Security","Credit Rating","Is the fair value of the asset determined by market quotations?","SCEIS GL No","Fund","Program Name or Use of Assets","Recorded Value","Eval","Fair value 6/30","How was fair value determination made","Review Notes"]
[{"$f":"AgencyCode","v":"E120"},"LPX","Louisiana Pac Co","Stock","Ba1","Yes",1234567891,12345678,"X Program",24719,"A",24719,"Market Price",{"$f":"IF(AND(D10=\"\",F10=\"\",G10=\"\",H10=\"\",J10=\"\",L10=\"\",M10=\"\")=TRUE,\"\",IF(OR(D10=\"\",F10=\"\",G10=\"\",H10=\"\",J10=\"\",L10=\"\",M10=\"\")=TRUE,\"Please complete remaining sections.\",\"\"))","v":""}]
{"$rows_left_out":47}
{"sheet":"3.01.4 Reviewer's Checklist","index":9,"n_rows":36,"n_cols":6,"rows_kept":36,"cut":false,"hidden":false,"merged":[[0,0,0,6],[5,0,5,4]]}
[{"$f":"CONCATENATE(\"STATE OF SOUTH CAROLINA\",\" - \",AgencyCode,\" \",AgencyName)","v":"STATE OF SOUTH CAROLINA - E120 COMPTROLLER GENERAL'S OFFICE\n"}]
["CASH AND INVESTMENTS REPORTING PACKAGE"]
["REVIEWER CHECKLIST"]
[{"$f":"IF(Year=\"\",\"\",\"FISCAL YEAR \"&Year)","v":"FISCAL YEAR 2024"}]
[]
["Type the name of the person reviewing this closing package and the date of the review.  The reviewer should also answer each of the sixteen questions below.  All questions must be answered either \"Yes\", \"No\", or \"N/A\" for non applicable.  If a question is left blank the closing package will be rejected and returned."]
["#","Question","Response","Explanation Required?","Explanation"]
[1,"Business Area",{"$f":"AgencyCode","v":"E120"}]
[2,"Date Last Review Step Was Completed:   ","2024-07-12"]
[3,"Reviewer","Reviewer Name"]
{"$rows_left_out":26}